{"text_format":"3","workbook":"xlsx","n_sheets":5,"sheets":["Anleitung","Laufliste","Rangliste","Notentabellen","Hilfsregister"],"read":"whole","date_system":"1900"}

{"sheet":"Anleitung","index":0,"n_rows":7,"n_cols":1,"rows_kept":7,"merged":[[0,0,0,11],[1,0,1,18],[2,0,2,18],[3,0,3,18],[4,0,4,18],[5,0,5,18],[6,0,6,18]]}
["12-Minuten-Lauf-Messtool Anleitung\nerstellt von Roman Marxer (romanmarxer@hotmail.com)"]
["Zweck und Beschreibung des Programms:"]
["Dieses Programm dient der effizienteren Durchführung und Auswertung von 12-Minuten-Läufen. Das Programm wurde an verschiedenen Klassen getestet und hat sich aus folgenden Gründen bewährt:\n- Errechnet automatisch Laufdistanzen, Ranglisten, Noten und Notendurchschnitte\n- Länge der Laufstrecke (Rundbahn, Halle) kann eingestellt werden\n- Zeiten, Noten und Notendurchschnitte sind ausblendbar; Notenskalen können angepasst werden\n- Einfügen von Schülerdaten direkt aus bestehenden Listen und dem Lehreroffice\n- Export der Daten in Leheroffice, etc. möglich"]
["Gebrauchsanleitung:"]
["Vorbereitung:\n1. Füge zuerst im Registerblatt \"Laufliste\" die Liste der LäuferInnen ein.\n2. Wähle die Sekundarstufe und das Geschlecht, damit die richtige Notenskala aktiviert wird.\n3. Wähle, ob du den 12-Minuten-Lauf auf einer Rundbahn oder in der Turnhalle machst.\nTipp: Falls die Eingabefelder (Wählen der Sekundarstufe, des Geschlechts, der Art der Laufstrecke) nicht funktionieren, klicke auf das Registerblatt \"Anleitung\", kehre danach wieder zurück zum Registerblatt \"Laufliste\" und versuche es nochmals.\n4. Notiere die Strecke der Rundlaufbahn (Zelle E4) bzw. die Hallenlängen (Zelle E4) und Breiten (Zelle F4) in Metern.\n\nDurchführung:\n5. Führe den Test mit den LäuferInnen wie gewohnt durch.\n6. Trage für jede/n LäuferIn die folgenden Werte direkt in das Programm ein:\n          - Falls du den Test auf einer Rundbahn gemacht hast: Anzahl Runden mit Kommastelle in Spalte C (bspw. bei zehneinhalb gelaufenen Runden 10.5)\n          - Falls du in der Halle gemacht hast: Anzahl Runden ohne Kommastelle in Spalte C plus Anzahl zusätzlicher Hallenlängen in Spalte D und Anzahl zusätzlicher Hallenbreiten in Spalte E\n\nAuswertung:\n7. Das Programm berechnet aus den eingegebenen Werten automatisch die gelaufenen Strecken, Noten und Notendurchschnitte sowie eine Rangliste. Die Noten- und Streckenspalten können ausgeblendet werden. Du kannst die Noten direkt aus dem Programm ins Lehreroffice kopieren.\n8.  Im Registerblatt \"Rangliste\" kann die LäuferInnen-Rangliste eingesehen werden.\n\nDieses Programm wurde von mir in meiner Freizeit entwickelt und hat mich einige Zeit und Nerven gekostet. Falls dir das Programm bei der Durchführung von 12-Minuten-Läufen hilft und du es regelmässig einsetzt, würde ich mich über eine kleine Spende von dir, deiner Schule oder deinem Verein freuen! Vielen Dank!\n\n"]
["Roman Marxer, IBAN: CH74 0070 0112 3000 7491 9, Konto-Nr.: 1123-0074.919 , Zahlungszweck: Spende 12-Minuten-Lauf-Messtool\n\nBei Fragen, Anmerkungen und Verbesserungsvorschlägen kannst du mich gerne per Mail kontaktieren: romanmarxer@hotmail.com"]
["Version 2.0, Juni 2017"]

{"sheet":"Laufliste","index":1,"n_rows":105,"n_cols":14,"rows_kept":105,"merged":[[0,0,0,3]]}
["Laufliste\nerstellt von Roman Marxer (romanmarxer@hotmail.com)"]
[null,"Sekundarstufe durch anklicken wählen","Geschlecht durch anklicken wählen","Wähle die Art der Laufstrecke",{"$f":"IF(N6=1, \"Gib in der Zelle unten die Strecke der Rundbahn in Meter an!\",\"Gib in der Zelle unten die Hallenlänge in Meter an!\")","v":"Gib in der Zelle unten die Strecke der Rundbahn in Meter an!"},{"$f":"IF(N6=1, \"\",\"Gib in der Zelle unten die Hallenbreite in Meter an!\")","v":""}]
[{"$nulls":4},400]
[]
["Nr.","LäuferIn",{"$f":"IF(N6=1, \"Anzahl Runden insgesamt (Teilstrecken mit Kommazahl angeben!)\", \"Anzahl Runden insgesamt\")","v":"Anzahl Runden insgesamt (Teilstrecken mit Kommazahl angeben!)"},{"$f":"IF(N6=1, \"\", \"Anzahl zusätzlicher Hallelängen\")","v":""},{"$f":"IF(N6=1, \"\", \"Anzahl zusätzlicher Hallebreiten\")","v":""},"Gelaufene Strecke in Meter","Note","Notendurchschnitt aller LäuferInnen",{"$nulls":4},"Hilfsfelder"]
[1,{"$nulls":4},{"$f":"IF(C6<=0,\"\",IF(N6=1,C6*$E$3,C6*($E$3+$F$3)+D6*$E$3+E6*$F$3))","v":""},{"$f":"IF(F6 = \"\", \" \", IF(AND(Notentabellen!$J$3=1,Notentabellen!$L$3=1),INDEX(Notentabellen!A:A,MATCH(F:F,Notentabellen!B:B,1)),IF(AND(Notentabellen!$J$3=1,Notentabellen!$L$3=2),INDEX(Notentabellen!A:A,MATCH(F:F,Notentabellen!C:C,1)),IF(AND(Notentabellen!$J$3=2,Notentabellen!$L$3=1),INDEX(Notentabellen!A:A,MATCH(F:F,Notentabellen!D:D,1)),IF(AND(Notentabellen!$J$3=2,Notentabellen!$L$3=2),INDEX(Notentabellen!A:A,MATCH(F:F,Notentabellen!E:E,1)),IF(AND(Notentabellen!$J$3 =3,Notentabellen!$L$3=1), INDEX(Notentabellen!A:A,MATCH(F:F,Notentabellen!F:F,1)), IF(AND(Notentabellen!$J$3 =3,Notentabellen!$L$3=2), INDEX(Notentabellen!A:A,MATCH(F:F,Notentabellen!G:G,1)))))))))","v":" "},{"$f":"AVERAGE(G6:G105)","v":{"$error":"#DIV/0!"}},{"$nulls":4},"Rundbahn",1]
[2,{"$nulls":4},"",{"$f":"IF(F7 = \"\", \" \", IF(AND(Notentabellen!$J$3=1,Notentabellen!$L$3=1),INDEX(Notentabellen!A:A,MATCH(F:F,Notentabellen!B:B,1)),IF(AND(Notentabellen!$J$3=1,Notentabellen!$L$3=2),INDEX(Notentabellen!A:A,MATCH(F:F,Notentabellen!C:C,1)),IF(AND(Notentabellen!$J$3=2,Notentabellen!$L$3=1),INDEX(Notentabellen!A:A,MATCH(F:F,Notentabellen!D:D,1)),IF(AND(Notentabellen!$J$3=2,Notentabellen!$L$3=2),INDEX(Notentabellen!A:A,MATCH(F:F,Notentabellen!E:E,1)),IF(AND(Notentabellen!$J$3 =3,Notentabellen!$L$3=1), INDEX(Notentabellen!A:A,MATCH(F:F,Notentabellen!F:F,1)), IF(AND(Notentabellen!$J$3 =3,Notentabellen!$L$3=2), INDEX(Notentabellen!A:A,MATCH(F:F,Notentabellen!G:G,1)))))))))","v":" "},{"$nulls":5},"Turnhalle"]
[3,{"$nulls":4},"",{"$f":"IF(F8 = \"\", \" \", IF(AND(Notentabellen!$J$3=1,Notentabellen!$L$3=1),INDEX(Notentabellen!A:A,MATCH(F:F,Notentabellen!B:B,1)),IF(AND(Notentabellen!$J$3=1,Notentabellen!$L$3=2),INDEX(Notentabellen!A:A,MATCH(F:F,Notentabellen!C:C,1)),IF(AND(Notentabellen!$J$3=2,Notentabellen!$L$3=1),INDEX(Notentabellen!A:A,MATCH(F:F,Notentabellen!D:D,1)),IF(AND(Notentabellen!$J$3=2,Notentabellen!$L$3=2),INDEX(Notentabellen!A:A,MATCH(F:F,Notentabellen!E:E,1)),IF(AND(Notentabellen!$J$3 =3,Notentabellen!$L$3=1), INDEX(Notentabellen!A:A,MATCH(F:F,Notentabellen!F:F,1)), IF(AND(Notentabellen!$J$3 =3,Notentabellen!$L$3=2), INDEX(Notentabellen!A:A,MATCH(F:F,Notentabellen!G:G,1)))))))))","v":" "}]
[4,{"$nulls":4},"",{"$f":"IF(F9 = \"\", \" \", IF(AND(Notentabellen!$J$3=1,Notentabellen!$L$3=1),INDEX(Notentabellen!A:A,MATCH(F:F,Notentabellen!B:B,1)),IF(AND(Notentabellen!$J$3=1,Notentabellen!$L$3=2),INDEX(Notentabellen!A:A,MATCH(F:F,Notentabellen!C:C,1)),IF(AND(Notentabellen!$J$3=2,Notentabellen!$L$3=1),INDEX(Notentabellen!A:A,MATCH(F:F,Notentabellen!D:D,1)),IF(AND(Notentabellen!$J$3=2,Notentabellen!$L$3=2),INDEX(Notentabellen!A:A,MATCH(F:F,Notentabellen!E:E,1)),IF(AND(Notentabellen!$J$3 =3,Notentabellen!$L$3=1), INDEX(Notentabellen!A:A,MATCH(F:F,Notentabellen!F:F,1)), IF(AND(Notentabellen!$J$3 =3,Notentabellen!$L$3=2), INDEX(Notentabellen!A:A,MATCH(F:F,Notentabellen!G:G,1)))))))))","v":" "}]
[5,{"$nulls":4},"",{"$f":"IF(F10 = \"\", \" \", IF(AND(Notentabellen!$J$3=1,Notentabellen!$L$3=1),INDEX(Notentabellen!A:A,MATCH(F:F,Notentabellen!B:B,1)),IF(AND(Notentabellen!$J$3=1,Notentabellen!$L$3=2),INDEX(Notentabellen!A:A,MATCH(F:F,Notentabellen!C:C,1)),IF(AND(Notentabellen!$J$3=2,Notentabellen!$L$3=1),INDEX(Notentabellen!A:A,MATCH(F:F,Notentabellen!D:D,1)),IF(AND(Notentabellen!$J$3=2,Notentabellen!$L$3=2),INDEX(Notentabellen!A:A,MATCH(F:F,Notentabellen!E:E,1)),IF(AND(Notentabellen!$J$3 =3,Notentabellen!$L$3=1), INDEX(Notentabellen!A:A,MATCH(F:F,Notentabellen!F:F,1)), IF(AND(Notentabellen!$J$3 =3,Notentabellen!$L$3=2), INDEX(Notentabellen!A:A,MATCH(F:F,Notentabellen!G:G,1)))))))))","v":" "}]
[6,{"$nulls":4},"",{"$f":"IF(F11 = \"\", \" \", IF(AND(Notentabellen!$J$3=1,Notentabellen!$L$3=1),INDEX(Notentabellen!A:A,MATCH(F:F,Notentabellen!B:B,1)),IF(AND(Notentabellen!$J$3=1,Notentabellen!$L$3=2),INDEX(Notentabellen!A:A,MATCH(F:F,Notentabellen!C:C,1)),IF(AND(Notentabellen!$J$3=2,Notentabellen!$L$3=1),INDEX(Notentabellen!A:A,MATCH(F:F,Notentabellen!D:D,1)),IF(AND(Notentabellen!$J$3=2,Notentabellen!$L$3=2),INDEX(Notentabellen!A:A,MATCH(F:F,Notentabellen!E:E,1)),IF(AND(Notentabellen!$J$3 =3,Notentabellen!$L$3=1), INDEX(Notentabellen!A:A,MATCH(F:F,Notentabellen!F:F,1)), IF(AND(Notentabellen!$J$3 =3,Notentabellen!$L$3=2), INDEX(Notentabellen!A:A,MATCH(F:F,Notentabellen!G:G,1)))))))))","v":" "}]
[7,{"$nulls":4},"",{"$f":"IF(F12 = \"\", \" \", IF(AND(Notentabellen!$J$3=1,Notentabellen!$L$3=1),INDEX(Notentabellen!A:A,MATCH(F:F,Notentabellen!B:B,1)),IF(AND(Notentabellen!$J$3=1,Notentabellen!$L$3=2),INDEX(Notentabellen!A:A,MATCH(F:F,Notentabellen!C:C,1)),IF(AND(Notentabellen!$J$3=2,Notentabellen!$L$3=1),INDEX(Notentabellen!A:A,MATCH(F:F,Notentabellen!D:D,1)),IF(AND(Notentabellen!$J$3=2,Notentabellen!$L$3=2),INDEX(Notentabellen!A:A,MATCH(F:F,Notentabellen!E:E,1)),IF(AND(Notentabellen!$J$3 =3,Notentabellen!$L$3=1), INDEX(Notentabellen!A:A,MATCH(F:F,Notentabellen!F:F,1)), IF(AND(Notentabellen!$J$3 =3,Notentabellen!$L$3=2), INDEX(Notentabellen!A:A,MATCH(F:F,Notentabellen!G:G,1)))))))))","v":" "}]
[8,{"$nulls":4},"",{"$f":"IF(F13 = \"\", \" \", IF(AND(Notentabellen!$J$3=1,Notentabellen!$L$3=1),INDEX(Notentabellen!A:A,MATCH(F:F,Notentabellen!B:B,1)),IF(AND(Notentabellen!$J$3=1,Notentabellen!$L$3=2),INDEX(Notentabellen!A:A,MATCH(F:F,Notentabellen!C:C,1)),IF(AND(Notentabellen!$J$3=2,Notentabellen!$L$3=1),INDEX(Notentabellen!A:A,MATCH(F:F,Notentabellen!D:D,1)),IF(AND(Notentabellen!$J$3=2,Notentabellen!$L$3=2),INDEX(Notentabellen!A:A,MATCH(F:F,Notentabellen!E:E,1)),IF(AND(Notentabellen!$J$3 =3,Notentabellen!$L$3=1), INDEX(Notentabellen!A:A,MATCH(F:F,Notentabellen!F:F,1)), IF(AND(Notentabellen!$J$3 =3,Notentabellen!$L$3=2), INDEX(Notentabellen!A:A,MATCH(F:F,Notentabellen!G:G,1)))))))))","v":" "}]
[9,{"$nulls":4},"",{"$f":"IF(F14 = \"\", \" \", IF(AND(Notentabellen!$J$3=1,Notentabellen!$L$3=1),INDEX(Notentabellen!A:A,MATCH(F:F,Notentabellen!B:B,1)),IF(AND(Notentabellen!$J$3=1,Notentabellen!$L$3=2),INDEX(Notentabellen!A:A,MATCH(F:F,Notentabellen!C:C,1)),IF(AND(Notentabellen!$J$3=2,Notentabellen!$L$3=1),INDEX(Notentabellen!A:A,MATCH(F:F,Notentabellen!D:D,1)),IF(AND(Notentabellen!$J$3=2,Notentabellen!$L$3=2),INDEX(Notentabellen!A:A,MATCH(F:F,Notentabellen!E:E,1)),IF(AND(Notentabellen!$J$3 =3,Notentabellen!$L$3=1), INDEX(Notentabellen!A:A,MATCH(F:F,Notentabellen!F:F,1)), IF(AND(Notentabellen!$J$3 =3,Notentabellen!$L$3=2), INDEX(Notentabellen!A:A,MATCH(F:F,Notentabellen!G:G,1)))))))))","v":" "}]
[10,{"$nulls":4},"",{"$f":"IF(F15 = \"\", \" \", IF(AND(Notentabellen!$J$3=1,Notentabellen!$L$3=1),INDEX(Notentabellen!A:A,MATCH(F:F,Notentabellen!B:B,1)),IF(AND(Notentabellen!$J$3=1,Notentabellen!$L$3=2),INDEX(Notentabellen!A:A,MATCH(F:F,Notentabellen!C:C,1)),IF(AND(Notentabellen!$J$3=2,Notentabellen!$L$3=1),INDEX(Notentabellen!A:A,MATCH(F:F,Notentabellen!D:D,1)),IF(AND(Notentabellen!$J$3=2,Notentabellen!$L$3=2),INDEX(Notentabellen!A:A,MATCH(F:F,Notentabellen!E:E,1)),IF(AND(Notentabellen!$J$3 =3,Notentabellen!$L$3=1), INDEX(Notentabellen!A:A,MATCH(F:F,Notentabellen!F:F,1)), IF(AND(Notentabellen!$J$3 =3,Notentabellen!$L$3=2), INDEX(Notentabellen!A:A,MATCH(F:F,Notentabellen!G:G,1)))))))))","v":" "}]
{"$rows_left_out":91}
{"sheet":"Rangliste","index":2,"n_rows":103,"n_cols":5,"rows_kept":103,"merged":[[0,0,0,4],[1,0,1,4]]}
["Rangliste"]
["Anmerkung: Zeiten, Noten und Notenschnitt (und diese Bemerkung) können ausgeblendet werden, indem die entsprechenden Spalten (bzw. diese Zeile) ausgeblendet werden!"]
["Rang","Läufer/in","Strecke","Note","Notenschnitt"]
[{"$f":"IF(C4=\"\",\"\",_xlfn.RANK.EQ(C4,C:C,0))","v":""},{"$f":"IF(C4=\"\",\"\",INDEX(Laufliste!B:B,_xlfn.AGGREGATE(15,6,ROW(Laufliste!F:F)/(Laufliste!F:F=C4),COUNTIF($C$4:C4,C4)),1))","v":""},{"$f":"IF(ISERROR(_xlfn.AGGREGATE(14,6,Laufliste!F:F,ROW()-3)),\"\",IF(ROWS($A$4:A4)<=Hilfsregister!$C$2,_xlfn.AGGREGATE(14,6,Laufliste!F:F,ROW()-3),\"\"))","v":""},{"$f":"IF(C4 = \"\", \"\", IF(AND(Notentabellen!$J$3=1,Notentabellen!$L$3=1),INDEX(Notentabellen!A:A,MATCH(C:C,Notentabellen!B:B,1)),IF(AND(Notentabellen!$J$3=1,Notentabellen!$L$3=2),INDEX(Notentabellen!A:A,MATCH(C:C,Notentabellen!C:C,1)),IF(AND(Notentabellen!$J$3=2,Notentabellen!$L$3=1),INDEX(Notentabellen!A:A,MATCH(C:C,Notentabellen!D:D,1)),IF(AND(Notentabellen!$J$3=2,Notentabellen!$L$3=2),INDEX(Notentabellen!A:A,MATCH(C:C,Notentabellen!E:E,1)),IF(AND(Notentabellen!$J$3 =3,Notentabellen!$L$3=1), INDEX(Notentabellen!A:A,MATCH(C:C,Notentabellen!F:F,1)), IF(AND(Notentabellen!$J$3 =3,Notentabellen!$L$3=2), INDEX(Notentabellen!A:A,MATCH(C:C,Notentabellen!G:G,1)))))))))","v":""},{"$f":"AVERAGE(D4:D103)","v":{"$error":"#DIV/0!"}}]
[{"$f":"IF(C5=\"\",\"\",_xlfn.RANK.EQ(C5,C:C,0))","v":""},{"$f":"IF(C5=\"\",\"\",INDEX(Laufliste!B:B,_xlfn.AGGREGATE(15,6,ROW(Laufliste!F:F)/(Laufliste!F:F=C5),COUNTIF($C$4:C5,C5)),1))","v":""},{"$f":"IF(ISERROR(_xlfn.AGGREGATE(14,6,Laufliste!F:F,ROW()-3)),\"\",IF(ROWS($A$4:A5)<=Hilfsregister!$C$2,_xlfn.AGGREGATE(14,6,Laufliste!F:F,ROW()-3),\"\"))","v":""},{"$f":"IF(C5 = \"\", \"\", IF(AND(Notentabellen!$J$3=1,Notentabellen!$L$3=1),INDEX(Notentabellen!A:A,MATCH(C:C,Notentabellen!B:B,1)),IF(AND(Notentabellen!$J$3=1,Notentabellen!$L$3=2),INDEX(Notentabellen!A:A,MATCH(C:C,Notentabellen!C:C,1)),IF(AND(Notentabellen!$J$3=2,Notentabellen!$L$3=1),INDEX(Notentabellen!A:A,MATCH(C:C,Notentabellen!D:D,1)),IF(AND(Notentabellen!$J$3=2,Notentabellen!$L$3=2),INDEX(Notentabellen!A:A,MATCH(C:C,Notentabellen!E:E,1)),IF(AND(Notentabellen!$J$3 =3,Notentabellen!$L$3=1), INDEX(Notentabellen!A:A,MATCH(C:C,Notentabellen!F:F,1)), IF(AND(Notentabellen!$J$3 =3,Notentabellen!$L$3=2), INDEX(Notentabellen!A:A,MATCH(C:C,Notentabellen!G:G,1)))))))))","v":""}]
["",{"$f":"IF(C6=\"\",\"\",INDEX(Laufliste!B:B,_xlfn.AGGREGATE(15,6,ROW(Laufliste!F:F)/(Laufliste!F:F=C6),COUNTIF($C$4:C6,C6)),1))","v":""},{"$f":"IF(ISERROR(_xlfn.AGGREGATE(14,6,Laufliste!F:F,ROW()-3)),\"\",IF(ROWS($A$4:A6)<=Hilfsregister!$C$2,_xlfn.AGGREGATE(14,6,Laufliste!F:F,ROW()-3),\"\"))","v":""},{"$f":"IF(C6 = \"\", \"\", IF(AND(Notentabellen!$J$3=1,Notentabellen!$L$3=1),INDEX(Notentabellen!A:A,MATCH(C:C,Notentabellen!B:B,1)),IF(AND(Notentabellen!$J$3=1,Notentabellen!$L$3=2),INDEX(Notentabellen!A:A,MATCH(C:C,Notentabellen!C:C,1)),IF(AND(Notentabellen!$J$3=2,Notentabellen!$L$3=1),INDEX(Notentabellen!A:A,MATCH(C:C,Notentabellen!D:D,1)),IF(AND(Notentabellen!$J$3=2,Notentabellen!$L$3=2),INDEX(Notentabellen!A:A,MATCH(C:C,Notentabellen!E:E,1)),IF(AND(Notentabellen!$J$3 =3,Notentabellen!$L$3=1), INDEX(Notentabellen!A:A,MATCH(C:C,Notentabellen!F:F,1)), IF(AND(Notentabellen!$J$3 =3,Notentabellen!$L$3=2), INDEX(Notentabellen!A:A,MATCH(C:C,Notentabellen!G:G,1)))))))))","v":""}]
["",{"$f":"IF(C7=\"\",\"\",INDEX(Laufliste!B:B,_xlfn.AGGREGATE(15,6,ROW(Laufliste!F:F)/(Laufliste!F:F=C7),COUNTIF($C$4:C7,C7)),1))","v":""},{"$f":"IF(ISERROR(_xlfn.AGGREGATE(14,6,Laufliste!F:F,ROW()-3)),\"\",IF(ROWS($A$4:A7)<=Hilfsregister!$C$2,_xlfn.AGGREGATE(14,6,Laufliste!F:F,ROW()-3),\"\"))","v":""},{"$f":"IF(C7 = \"\", \"\", IF(AND(Notentabellen!$J$3=1,Notentabellen!$L$3=1),INDEX(Notentabellen!A:A,MATCH(C:C,Notentabellen!B:B,1)),IF(AND(Notentabellen!$J$3=1,Notentabellen!$L$3=2),INDEX(Notentabellen!A:A,MATCH(C:C,Notentabellen!C:C,1)),IF(AND(Notentabellen!$J$3=2,Notentabellen!$L$3=1),INDEX(Notentabellen!A:A,MATCH(C:C,Notentabellen!D:D,1)),IF(AND(Notentabellen!$J$3=2,Notentabellen!$L$3=2),INDEX(Notentabellen!A:A,MATCH(C:C,Notentabellen!E:E,1)),IF(AND(Notentabellen!$J$3 =3,Notentabellen!$L$3=1), INDEX(Notentabellen!A:A,MATCH(C:C,Notentabellen!F:F,1)), IF(AND(Notentabellen!$J$3 =3,Notentabellen!$L$3=2), INDEX(Notentabellen!A:A,MATCH(C:C,Notentabellen!G:G,1)))))))))","v":""}]
["",{"$f":"IF(C8=\"\",\"\",INDEX(Laufliste!B:B,_xlfn.AGGREGATE(15,6,ROW(Laufliste!F:F)/(Laufliste!F:F=C8),COUNTIF($C$4:C8,C8)),1))","v":""},{"$f":"IF(ISERROR(_xlfn.AGGREGATE(14,6,Laufliste!F:F,ROW()-3)),\"\",IF(ROWS($A$4:A8)<=Hilfsregister!$C$2,_xlfn.AGGREGATE(14,6,Laufliste!F:F,ROW()-3),\"\"))","v":""},{"$f":"IF(C8 = \"\", \"\", IF(AND(Notentabellen!$J$3=1,Notentabellen!$L$3=1),INDEX(Notentabellen!A:A,MATCH(C:C,Notentabellen!B:B,1)),IF(AND(Notentabellen!$J$3=1,Notentabellen!$L$3=2),INDEX(Notentabellen!A:A,MATCH(C:C,Notentabellen!C:C,1)),IF(AND(Notentabellen!$J$3=2,Notentabellen!$L$3=1),INDEX(Notentabellen!A:A,MATCH(C:C,Notentabellen!D:D,1)),IF(AND(Notentabellen!$J$3=2,Notentabellen!$L$3=2),INDEX(Notentabellen!A:A,MATCH(C:C,Notentabellen!E:E,1)),IF(AND(Notentabellen!$J$3 =3,Notentabellen!$L$3=1), INDEX(Notentabellen!A:A,MATCH(C:C,Notentabellen!F:F,1)), IF(AND(Notentabellen!$J$3 =3,Notentabellen!$L$3=2), INDEX(Notentabellen!A:A,MATCH(C:C,Notentabellen!G:G,1)))))))))","v":""}]
["",{"$f":"IF(C9=\"\",\"\",INDEX(Laufliste!B:B,_xlfn.AGGREGATE(15,6,ROW(Laufliste!F:F)/(Laufliste!F:F=C9),COUNTIF($C$4:C9,C9)),1))","v":""},{"$f":"IF(ISERROR(_xlfn.AGGREGATE(14,6,Laufliste!F:F,ROW()-3)),\"\",IF(ROWS($A$4:A9)<=Hilfsregister!$C$2,_xlfn.AGGREGATE(14,6,Laufliste!F:F,ROW()-3),\"\"))","v":""},{"$f":"IF(C9 = \"\", \"\", IF(AND(Notentabellen!$J$3=1,Notentabellen!$L$3=1),INDEX(Notentabellen!A:A,MATCH(C:C,Notentabellen!B:B,1)),IF(AND(Notentabellen!$J$3=1,Notentabellen!$L$3=2),INDEX(Notentabellen!A:A,MATCH(C:C,Notentabellen!C:C,1)),IF(AND(Notentabellen!$J$3=2,Notentabellen!$L$3=1),INDEX(Notentabellen!A:A,MATCH(C:C,Notentabellen!D:D,1)),IF(AND(Notentabellen!$J$3=2,Notentabellen!$L$3=2),INDEX(Notentabellen!A:A,MATCH(C:C,Notentabellen!E:E,1)),IF(AND(Notentabellen!$J$3 =3,Notentabellen!$L$3=1), INDEX(Notentabellen!A:A,MATCH(C:C,Notentabellen!F:F,1)), IF(AND(Notentabellen!$J$3 =3,Notentabellen!$L$3=2), INDEX(Notentabellen!A:A,MATCH(C:C,Notentabellen!G:G,1)))))))))","v":""}]
["",{"$f":"IF(C10=\"\",\"\",INDEX(Laufliste!B:B,_xlfn.AGGREGATE(15,6,ROW(Laufliste!F:F)/(Laufliste!F:F=C10),COUNTIF($C$4:C10,C10)),1))","v":""},{"$f":"IF(ISERROR(_xlfn.AGGREGATE(14,6,Laufliste!F:F,ROW()-3)),\"\",IF(ROWS($A$4:A10)<=Hilfsregister!$C$2,_xlfn.AGGREGATE(14,6,Laufliste!F:F,ROW()-3),\"\"))","v":""},{"$f":"IF(C10 = \"\", \"\", IF(AND(Notentabellen!$J$3=1,Notentabellen!$L$3=1),INDEX(Notentabellen!A:A,MATCH(C:C,Notentabellen!B:B,1)),IF(AND(Notentabellen!$J$3=1,Notentabellen!$L$3=2),INDEX(Notentabellen!A:A,MATCH(C:C,Notentabellen!C:C,1)),IF(AND(Notentabellen!$J$3=2,Notentabellen!$L$3=1),INDEX(Notentabellen!A:A,MATCH(C:C,Notentabellen!D:D,1)),IF(AND(Notentabellen!$J$3=2,Notentabellen!$L$3=2),INDEX(Notentabellen!A:A,MATCH(C:C,Notentabellen!E:E,1)),IF(AND(Notentabellen!$J$3 =3,Notentabellen!$L$3=1), INDEX(Notentabellen!A:A,MATCH(C:C,Notentabellen!F:F,1)), IF(AND(Notentabellen!$J$3 =3,Notentabellen!$L$3=2), INDEX(Notentabellen!A:A,MATCH(C:C,Notentabellen!G:G,1)))))))))","v":""}]
["",{"$f":"IF(C11=\"\",\"\",INDEX(Laufliste!B:B,_xlfn.AGGREGATE(15,6,ROW(Laufliste!F:F)/(Laufliste!F:F=C11),COUNTIF($C$4:C11,C11)),1))","v":""},{"$f":"IF(ISERROR(_xlfn.AGGREGATE(14,6,Laufliste!F:F,ROW()-3)),\"\",IF(ROWS($A$4:A11)<=Hilfsregister!$C$2,_xlfn.AGGREGATE(14,6,Laufliste!F:F,ROW()-3),\"\"))","v":""},{"$f":"IF(C11 = \"\", \"\", IF(AND(Notentabellen!$J$3=1,Notentabellen!$L$3=1),INDEX(Notentabellen!A:A,MATCH(C:C,Notentabellen!B:B,1)),IF(AND(Notentabellen!$J$3=1,Notentabellen!$L$3=2),INDEX(Notentabellen!A:A,MATCH(C:C,Notentabellen!C:C,1)),IF(AND(Notentabellen!$J$3=2,Notentabellen!$L$3=1),INDEX(Notentabellen!A:A,MATCH(C:C,Notentabellen!D:D,1)),IF(AND(Notentabellen!$J$3=2,Notentabellen!$L$3=2),INDEX(Notentabellen!A:A,MATCH(C:C,Notentabellen!E:E,1)),IF(AND(Notentabellen!$J$3 =3,Notentabellen!$L$3=1), INDEX(Notentabellen!A:A,MATCH(C:C,Notentabellen!F:F,1)), IF(AND(Notentabellen!$J$3 =3,Notentabellen!$L$3=2), INDEX(Notentabellen!A:A,MATCH(C:C,Notentabellen!G:G,1)))))))))","v":""}]
["",{"$f":"IF(C12=\"\",\"\",INDEX(Laufliste!B:B,_xlfn.AGGREGATE(15,6,ROW(Laufliste!F:F)/(Laufliste!F:F=C12),COUNTIF($C$4:C12,C12)),1))","v":""},{"$f":"IF(ISERROR(_xlfn.AGGREGATE(14,6,Laufliste!F:F,ROW()-3)),\"\",IF(ROWS($A$4:A12)<=Hilfsregister!$C$2,_xlfn.AGGREGATE(14,6,Laufliste!F:F,ROW()-3),\"\"))","v":""},{"$f":"IF(C12 = \"\", \"\", IF(AND(Notentabellen!$J$3=1,Notentabellen!$L$3=1),INDEX(Notentabellen!A:A,MATCH(C:C,Notentabellen!B:B,1)),IF(AND(Notentabellen!$J$3=1,Notentabellen!$L$3=2),INDEX(Notentabellen!A:A,MATCH(C:C,Notentabellen!C:C,1)),IF(AND(Notentabellen!$J$3=2,Notentabellen!$L$3=1),INDEX(Notentabellen!A:A,MATCH(C:C,Notentabellen!D:D,1)),IF(AND(Notentabellen!$J$3=2,Notentabellen!$L$3=2),INDEX(Notentabellen!A:A,MATCH(C:C,Notentabellen!E:E,1)),IF(AND(Notentabellen!$J$3 =3,Notentabellen!$L$3=1), INDEX(Notentabellen!A:A,MATCH(C:C,Notentabellen!F:F,1)), IF(AND(Notentabellen!$J$3 =3,Notentabellen!$L$3=2), INDEX(Notentabellen!A:A,MATCH(C:C,Notentabellen!G:G,1)))))))))","v":""}]
["",{"$f":"IF(C13=\"\",\"\",INDEX(Laufliste!B:B,_xlfn.AGGREGATE(15,6,ROW(Laufliste!F:F)/(Laufliste!F:F=C13),COUNTIF($C$4:C13,C13)),1))","v":""},{"$f":"IF(ISERROR(_xlfn.AGGREGATE(14,6,Laufliste!F:F,ROW()-3)),\"\",IF(ROWS($A$4:A13)<=Hilfsregister!$C$2,_xlfn.AGGREGATE(14,6,Laufliste!F:F,ROW()-3),\"\"))","v":""},{"$f":"IF(C13 = \"\", \"\", IF(AND(Notentabellen!$J$3=1,Notentabellen!$L$3=1),INDEX(Notentabellen!A:A,MATCH(C:C,Notentabellen!B:B,1)),IF(AND(Notentabellen!$J$3=1,Notentabellen!$L$3=2),INDEX(Notentabellen!A:A,MATCH(C:C,Notentabellen!C:C,1)),IF(AND(Notentabellen!$J$3=2,Notentabellen!$L$3=1),INDEX(Notentabellen!A:A,MATCH(C:C,Notentabellen!D:D,1)),IF(AND(Notentabellen!$J$3=2,Notentabellen!$L$3=2),INDEX(Notentabellen!A:A,MATCH(C:C,Notentabellen!E:E,1)),IF(AND(Notentabellen!$J$3 =3,Notentabellen!$L$3=1), INDEX(Notentabellen!A:A,MATCH(C:C,Notentabellen!F:F,1)), IF(AND(Notentabellen!$J$3 =3,Notentabellen!$L$3=2), INDEX(Notentabellen!A:A,MATCH(C:C,Notentabellen!G:G,1)))))))))","v":""}]
["",{"$f":"IF(C14=\"\",\"\",INDEX(Laufliste!B:B,_xlfn.AGGREGATE(15,6,ROW(Laufliste!F:F)/(Laufliste!F:F=C14),COUNTIF($C$4:C14,C14)),1))","v":""},{"$f":"IF(ISERROR(_xlfn.AGGREGATE(14,6,Laufliste!F:F,ROW()-3)),\"\",IF(ROWS($A$4:A14)<=Hilfsregister!$C$2,_xlfn.AGGREGATE(14,6,Laufliste!F:F,ROW()-3),\"\"))","v":""},{"$f":"IF(C14 = \"\", \"\", IF(AND(Notentabellen!$J$3=1,Notentabellen!$L$3=1),INDEX(Notentabellen!A:A,MATCH(C:C,Notentabellen!B:B,1)),IF(AND(Notentabellen!$J$3=1,Notentabellen!$L$3=2),INDEX(Notentabellen!A:A,MATCH(C:C,Notentabellen!C:C,1)),IF(AND(Notentabellen!$J$3=2,Notentabellen!$L$3=1),INDEX(Notentabellen!A:A,MATCH(C:C,Notentabellen!D:D,1)),IF(AND(Notentabellen!$J$3=2,Notentabellen!$L$3=2),INDEX(Notentabellen!A:A,MATCH(C:C,Notentabellen!E:E,1)),IF(AND(Notentabellen!$J$3 =3,Notentabellen!$L$3=1), INDEX(Notentabellen!A:A,MATCH(C:C,Notentabellen!F:F,1)), IF(AND(Notentabellen!$J$3 =3,Notentabellen!$L$3=2), INDEX(Notentabellen!A:A,MATCH(C:C,Notentabellen!G:G,1)))))))))","v":""}]
["",{"$f":"IF(C15=\"\",\"\",INDEX(Laufliste!B:B,_xlfn.AGGREGATE(15,6,ROW(Laufliste!F:F)/(Laufliste!F:F=C15),COUNTIF($C$4:C15,C15)),1))","v":""},{"$f":"IF(ISERROR(_xlfn.AGGREGATE(14,6,Laufliste!F:F,ROW()-3)),\"\",IF(ROWS($A$4:A15)<=Hilfsregister!$C$2,_xlfn.AGGREGATE(14,6,Laufliste!F:F,ROW()-3),\"\"))","v":""},{"$f":"IF(C15 = \"\", \"\", IF(AND(Notentabellen!$J$3=1,Notentabellen!$L$3=1),INDEX(Notentabellen!A:A,MATCH(C:C,Notentabellen!B:B,1)),IF(AND(Notentabellen!$J$3=1,Notentabellen!$L$3=2),INDEX(Notentabellen!A:A,MATCH(C:C,Notentabellen!C:C,1)),IF(AND(Notentabellen!$J$3=2,Notentabellen!$L$3=1),INDEX(Notentabellen!A:A,MATCH(C:C,Notentabellen!D:D,1)),IF(AND(Notentabellen!$J$3=2,Notentabellen!$L$3=2),INDEX(Notentabellen!A:A,MATCH(C:C,Notentabellen!E:E,1)),IF(AND(Notentabellen!$J$3 =3,Notentabellen!$L$3=1), INDEX(Notentabellen!A:A,MATCH(C:C,Notentabellen!F:F,1)), IF(AND(Notentabellen!$J$3 =3,Notentabellen!$L$3=2), INDEX(Notentabellen!A:A,MATCH(C:C,Notentabellen!G:G,1)))))))))","v":""}]
{"$rows_left_out":89}
{"sheet":"Notentabellen","index":3,"n_rows":54,"n_cols":12,"rows_kept":54,"merged":[[0,0,0,6]]}
["Notentabellen\nerstellt von Roman Marxer (romanmarxer@hotmail.com)  "]
["Note","Strecke Knaben 1. Sek","Strecke Mädchen 1. Sek","Strecke Jungs 2. Sek","Strecke Mädchen 2. Sek","Strecke Jungs 3. Sek","Strecke Mädchen 3. Sek",null,"Hilfsfelder"]
[0.9999999999999,0,0,0,0,0,0,null,"Sekundarstufe 1",1,"Jungs",1]
[0.9999999999999,1630,1630,1660,1660,1660,1660,null,"Sekundarstufe 2",null,"Mädchen"]
[1.09999999999991,1650,1650,1680,1680,1680,1680,null,"Sekundarstufe 3"]
[1.19999999999992,1670,1670,1700,1700,1700,1700]
[1.29999999999993,1690,1690,1720,1720,1720,1720]
[1.39999999999994,1710,1710,1740,1740,1740,1740]
[1.49999999999995,1730,1730,1760,1760,1760,1760]
[1.59999999999996,1750,1750,1780,1780,1780,1780]
[1.69999999999997,1770,1770,1800,1800,1800,1800]
[1.79999999999998,1790,1790,1820,1820,1820,1820]
[1.89999999999999,1810,1810,1840,1840,1840,1840]
[2,1830,1830,1860,1860,1860,1860]
[2.10000000000001,1850,1850,1880,1880,1880,1880]
{"$rows_left_out":40}
{"sheet":"Hilfsregister","index":4,"n_rows":12,"n_cols":3,"rows_kept":12,"hidden":true}
[null,"Ausgabe:","Umrechung Ausgabe in Top"]
["Top 5",3,{"$f":"IF(B2<=10,B2*5,100)","v":15}]
["Top 10"]
["Top 15"]
["Top 20"]
["Top 25"]
["Top 30"]
["Top 35"]
["Top 40"]
["Top 45"]
["Top 50"]
["Alle"]