{"text_format":"3","workbook":"xlsx","n_sheets":8,"sheets":["Anleitung","Übersicht","Rangliste","Punkte-Wertetabellen Mädchen","Punkte-Wertetabellen Knaben","Notentabellen","Laufzettel","Hilfsregister"],"not_rendered":{"images":5,"defined_names":3},"read":"whole","date_system":"1900"}

{"sheet":"Anleitung","index":0,"n_rows":14,"n_cols":3,"rows_kept":14,"merged":[[0,0,0,15],[1,0,1,8],[1,9,1,15],[2,0,2,8],[3,0,3,15],[4,0,4,1],[5,0,5,15],[6,0,6,8],[8,2,8,15],[9,2,9,15],[10,2,10,15],[11,2,11,15],[12,2,12,15],[13,2,13,15]]}
["Leichtathletik-Sporttag-Erfassungstool"]
["Anleitung\n"]
["erstellt von Roman Marxer (romanmarxer@hotmail.com)"]
["Im Registerblatt \"Übersicht\" werden alle wichtigen Daten erfasst: Geschlecht, Schulstufe, Namen, Vornamen, Klassen und Leistungen/Resultate der verschiedenen Leichtathletikdisziplinen (80m-Lauf, Hochsprung, Weitsprung, Weitwurf, Kugelstossen, 2000m-Lauf). Nachdem das Geschlecht und die Schulstufe gewählt wurden, wird jeder Leistung automatisch die entsprechende Punktzahl zugewiesen. Ausserdem wird die Gesamtpunktzahl und eine Note berechnet. Als Beispiel einer Dateneingabe habe ich \"\"Hans Muster\"\" hinzugefügt. Dieser kann bei der ersten Eingabe herausgelöscht werden!\n\nAus der Gesamtpunktzahl wird eine Rangliste erstellt, die im Registerblatt \"Rangliste\" ersichtlich ist.\n\nDie Punkte-Wertetabellen können im Registerblatt \"Punkte-Wertetabellen Knaben\" angepasst werden. Die Spalte \"Noten\" kann für den Ausdruck auch ausgeblendet werden (Spalte W in der Registerkarte \"Übersicht\" anwählen, rechtsklick, \"ausblenden\" wählen). Die Notentabellen im Registerblatt \"Notentabellen\" angepasst werden. \n\nDie Übersicht kann mit Hilfe der kleinen Pfeile in der sechsten Zeile nach Klasse, Name, etc. sortiert werden.\n\nDie Übersicht und die Rangliste ist so formatiert, dass sie perfekt auf ein A4 passt, also sofort druckbereit ist. Gehe dazu in die Seitenansicht.\n\nDieses Programm wurde von mir in meiner Freizeit entwickelt und hat mich einige Zeit und Nerven gekostet. Falls dir das Programm bei der Durchführung von Leichtathletikturnieren hilft und du es regelmässig einsetzt, würde ich mich über eine kleine Spende von dir, deiner Schule oder deinem Verein freuen! Vielen Dank!\n\nRoman Marxer, IBAN: CH74 0070 0112 3000 7491 9, Konto-Nr.: 1123-0074.919 , Zahlungszweck: Spende Leichtathletik-Sporttag-Erfassungstool\n\nBei Fragen, Anmerkungen und Verbesserungsvorschlägen kannst du mich gerne per Mail kontaktieren: romanmarxer@hotmail.com                 "]
["Version 5.0, Juni 2017"]
[]
["Schritt für Schritt (Kurzanleitung):\n"]
["Schritt:","Registerblatt","Was?"]
[1,"Übersicht","Wähle das Geschlecht und die Stufe, indem du auf die entsprechende Schaltfläche klickst. "]
[2,"Übersicht","Gib die SportlerInnen-Daten ein (Name, Vorname, Klasse)."]
{"$rows_left_out":5}
{"sheet":"Übersicht","index":1,"n_rows":101,"n_cols":24,"rows_kept":101,"merged":[[0,0,0,21],[1,0,1,4],[1,5,1,11],[1,12,1,18],[1,19,1,23],[3,0,4,0],[3,1,4,1],[3,2,4,2],[3,21,3,23]]}
["Leichtathletik-Sporttag-Übersicht"]
["Geschlecht: \n",{"$nulls":4},"Stufe:",{"$nulls":6},"Rangliste:"]
[]
["Name","Vorname","Klasse",null,"80m Lauf",null,null,"Hochsprung",null,null,"Weitsprung",null,null,"Weitwurf",null,null,"Kugelstossen",null,null,"2000m Lauf",null,"Total"]
[{"$nulls":3},"Leistung",null,"Punkte","Leistung",null,"Punkte","Leistung",null,"Punkte","Leistung",null,"Punkte","Leistung",null,"Punkte","Leistung",null,"Punkte","Punkte","Rang","Note"]
["Spalte1","Spalte2","Spalte3","Spalte4","Spalte5","Spalte6","Spalte7","Spalte8","Spalte9","Spalte10","Spalte11","Spalte12","Spalte13","Spalte14","Spalte15","Spalte16","Spalte17","Spalte18","Spalte19","Spalte20","Spalte21","Spalte22","Spalte23","Spalte24"]
["Hans","Muster","1a",{"v":12,"d":"12.00"},null,{"$f":"IF(D7=\"\",0,IF(Hilfsregister!$B$2=1, INDEX('Punkte-Wertetabellen Mädchen'!A:A,MATCH(Übersicht!D:D,'Punkte-Wertetabellen Mädchen'!B:B)), INDEX('Punkte-Wertetabellen Knaben'!A:A,MATCH(Übersicht!D:D,'Punkte-Wertetabellen Knaben'!B:B))))","v":10},{"v":1.4,"d":"1.40"},null,{"$f":"IF(Hilfsregister!$B$2 = 1, INDEX('Punkte-Wertetabellen Mädchen'!A:A,MATCH(Übersicht!G:G,'Punkte-Wertetabellen Mädchen'!C:C,-1)), INDEX('Punkte-Wertetabellen Knaben'!A:A,MATCH(Übersicht!G:G,'Punkte-Wertetabellen Knaben'!C:C,-1)))","v":12},{"v":4,"d":"4.00"},null,{"$f":"IF(Hilfsregister!$B$2=1, INDEX('Punkte-Wertetabellen Mädchen'!A:A,MATCH(Übersicht!J:J,'Punkte-Wertetabellen Mädchen'!D:D,-1)), INDEX('Punkte-Wertetabellen Knaben'!A:A,MATCH(Übersicht!J:J,'Punkte-Wertetabellen Knaben'!D:D,-1)))","v":9},{"v":40,"d":"40.00"},null,{"$f":"IF(Hilfsregister!$B$2=1, INDEX('Punkte-Wertetabellen Mädchen'!A:A,MATCH(Übersicht!M:M,'Punkte-Wertetabellen Mädchen'!E:E,-1)), INDEX('Punkte-Wertetabellen Knaben'!A:A,MATCH(Übersicht!M:M,'Punkte-Wertetabellen Knaben'!E:E,-1)))","v":13},{"v":4,"d":"4.00"},null,{"$f":"IF(Hilfsregister!$B$2=1, INDEX('Punkte-Wertetabellen Mädchen'!A:A,MATCH(Übersicht!P:P,'Punkte-Wertetabellen Mädchen'!F:F,-1)), INDEX('Punkte-Wertetabellen Knaben'!A:A,MATCH(Übersicht!P:P,'Punkte-Wertetabellen Knaben'!F:F,-1)))","v":4},"07:00:00",null,{"$f":"IF(S7=\"\",0,IF(Hilfsregister!$B$2=1, INDEX('Punkte-Wertetabellen Mädchen'!A:A,MATCH(Übersicht!S:S,'Punkte-Wertetabellen Mädchen'!G:G,1)), INDEX('Punkte-Wertetabellen Knaben'!A:A,MATCH(Übersicht!S:S,'Punkte-Wertetabellen Knaben'!G:G,1))))","v":20},{"$f":"IF(A7=\"\",\"\",IF(ISERROR(SUM(U7+R7+O7+L7+I7+F7)),\"\",SUM(U7+R7+O7+L7+I7+F7)))","v":68},{"$f":"IF(V7=\"\",\"\",_xlfn.RANK.EQ(V7,$V$7:$V$101,0))","v":1},{"$f":"IF(OR(V7=\"\",V7=0),\"\",IF(Hilfsregister!$B$4=1, INDEX(Notentabellen!$A$5:$A$22,MATCH(V7,Notentabellen!$B$5:$B$35,-1)), IF(Hilfsregister!$B$4=2, INDEX(Notentabellen!$A$5:$A$22,MATCH(V7,Notentabellen!$C$5:$C$35,-1)), IF(Hilfsregister!$B$4=3, INDEX(Notentabellen!$A$5:$A$22,MATCH(V7,Notentabellen!$D$5:$D$35,-1)), IF(Hilfsregister!$B$4=4, INDEX(Notentabellen!$A$5:$A$22,MATCH(V7,Notentabellen!$E$5:$E$35,-1)), IF(Hilfsregister!$B$4=5, INDEX(Notentabellen!$A$5:$A$22,MATCH(V7,Notentabellen!$F$5:$F$35,-1)), IF(Hilfsregister!$B$4=6, INDEX(Notentabellen!$A$5:$A$22,MATCH(V7,Notentabellen!$G$5:$G$35,-1)),IF(Hilfsregister!$B$4=7, INDEX(Notentabellen!$A$5:$A$22,MATCH(V7,Notentabellen!$H$5:$H$35,-1)), IF(Hilfsregister!$B$4=8, INDEX(Notentabellen!$A$5:$A$22,MATCH(V7,Notentabellen!$I$5:$I$35,-1)),IF(Hilfsregister!$B$4=9,INDEX(Notentabellen!$A$5:$A$22,MATCH(V7,Notentabellen!$J$5:$J$35,-1)), IF(Hilfsregister!$B$4=10, INDEX(Notentabellen!$A$5:$A$22,MATCH(V7,Notentabellen!$K$5:$K$35,-1)), IF(Hilfsregister!$B$4=11, INDEX(Notentabellen!$A$5:$A$22,MATCH(V7,Notentabellen!$L$5:$L$35,-1)),IF(Hilfsregister!$B$4=12, INDEX(Notentabellen!$A$5:$A$22,MATCH(V7,Notentabellen!$M$5:$M$35,-1)))))))))))))))","v":5.25}]
[{"$nulls":5},{"$f":"IF(D8=\"\",0,IF(Hilfsregister!$B$2=1, INDEX('Punkte-Wertetabellen Mädchen'!A:A,MATCH(Übersicht!D:D,'Punkte-Wertetabellen Mädchen'!B:B)), INDEX('Punkte-Wertetabellen Knaben'!A:A,MATCH(Übersicht!D:D,'Punkte-Wertetabellen Knaben'!B:B))))","v":0},null,null,{"$f":"IF(Hilfsregister!$B$2 = 1, INDEX('Punkte-Wertetabellen Mädchen'!A:A,MATCH(Übersicht!G:G,'Punkte-Wertetabellen Mädchen'!C:C,-1)), INDEX('Punkte-Wertetabellen Knaben'!A:A,MATCH(Übersicht!G:G,'Punkte-Wertetabellen Knaben'!C:C,-1)))","v":0},null,null,{"$f":"IF(Hilfsregister!$B$2=1, INDEX('Punkte-Wertetabellen Mädchen'!A:A,MATCH(Übersicht!J:J,'Punkte-Wertetabellen Mädchen'!D:D,-1)), INDEX('Punkte-Wertetabellen Knaben'!A:A,MATCH(Übersicht!J:J,'Punkte-Wertetabellen Knaben'!D:D,-1)))","v":0},null,null,{"$f":"IF(Hilfsregister!$B$2=1, INDEX('Punkte-Wertetabellen Mädchen'!A:A,MATCH(Übersicht!M:M,'Punkte-Wertetabellen Mädchen'!E:E,-1)), INDEX('Punkte-Wertetabellen Knaben'!A:A,MATCH(Übersicht!M:M,'Punkte-Wertetabellen Knaben'!E:E,-1)))","v":0},null,null,{"$f":"IF(Hilfsregister!$B$2=1, INDEX('Punkte-Wertetabellen Mädchen'!A:A,MATCH(Übersicht!P:P,'Punkte-Wertetabellen Mädchen'!F:F,-1)), INDEX('Punkte-Wertetabellen Knaben'!A:A,MATCH(Übersicht!P:P,'Punkte-Wertetabellen Knaben'!F:F,-1)))","v":0},null,null,{"$f":"IF(S8=\"\",0,IF(Hilfsregister!$B$2=1, INDEX('Punkte-Wertetabellen Mädchen'!A:A,MATCH(Übersicht!S:S,'Punkte-Wertetabellen Mädchen'!G:G,1)), INDEX('Punkte-Wertetabellen Knaben'!A:A,MATCH(Übersicht!S:S,'Punkte-Wertetabellen Knaben'!G:G,1))))","v":0},{"$f":"IF(A8=\"\",\"\",IF(ISERROR(SUM(U8+R8+O8+L8+I8+F8)),\"\",SUM(U8+R8+O8+L8+I8+F8)))","v":""},{"$f":"IF(V8=\"\",\"\",_xlfn.RANK.EQ(V8,$V$7:$V$101,0))","v":""},{"$f":"IF(OR(V8=\"\",V8=0),\"\",IF(Hilfsregister!$B$4=1, INDEX(Notentabellen!$A$5:$A$22,MATCH(V8,Notentabellen!$B$5:$B$35,-1)), IF(Hilfsregister!$B$4=2, INDEX(Notentabellen!$A$5:$A$22,MATCH(V8,Notentabellen!$C$5:$C$35,-1)), IF(Hilfsregister!$B$4=3, INDEX(Notentabellen!$A$5:$A$22,MATCH(V8,Notentabellen!$D$5:$D$35,-1)), IF(Hilfsregister!$B$4=4, INDEX(Notentabellen!$A$5:$A$22,MATCH(V8,Notentabellen!$E$5:$E$35,-1)), IF(Hilfsregister!$B$4=5, INDEX(Notentabellen!$A$5:$A$22,MATCH(V8,Notentabellen!$F$5:$F$35,-1)), IF(Hilfsregister!$B$4=6, INDEX(Notentabellen!$A$5:$A$22,MATCH(V8,Notentabellen!$G$5:$G$35,-1)),IF(Hilfsregister!$B$4=7, INDEX(Notentabellen!$A$5:$A$22,MATCH(V8,Notentabellen!$H$5:$H$35,-1)), IF(Hilfsregister!$B$4=8, INDEX(Notentabellen!$A$5:$A$22,MATCH(V8,Notentabellen!$I$5:$I$35,-1)),IF(Hilfsregister!$B$4=9,INDEX(Notentabellen!$A$5:$A$22,MATCH(V8,Notentabellen!$J$5:$J$35,-1)), IF(Hilfsregister!$B$4=10, INDEX(Notentabellen!$A$5:$A$22,MATCH(V8,Notentabellen!$K$5:$K$35,-1)), IF(Hilfsregister!$B$4=11, INDEX(Notentabellen!$A$5:$A$22,MATCH(V8,Notentabellen!$L$5:$L$35,-1)),IF(Hilfsregister!$B$4=12, INDEX(Notentabellen!$A$5:$A$22,MATCH(V8,Notentabellen!$M$5:$M$35,-1)))))))))))))))","v":""}]
[{"$nulls":5},{"$f":"IF(D9=\"\",0,IF(Hilfsregister!$B$2=1, INDEX('Punkte-Wertetabellen Mädchen'!A:A,MATCH(Übersicht!D:D,'Punkte-Wertetabellen Mädchen'!B:B)), INDEX('Punkte-Wertetabellen Knaben'!A:A,MATCH(Übersicht!D:D,'Punkte-Wertetabellen Knaben'!B:B))))","v":0},null,null,{"$f":"IF(Hilfsregister!$B$2 = 1, INDEX('Punkte-Wertetabellen Mädchen'!A:A,MATCH(Übersicht!G:G,'Punkte-Wertetabellen Mädchen'!C:C,-1)), INDEX('Punkte-Wertetabellen Knaben'!A:A,MATCH(Übersicht!G:G,'Punkte-Wertetabellen Knaben'!C:C,-1)))","v":0},null,null,{"$f":"IF(Hilfsregister!$B$2=1, INDEX('Punkte-Wertetabellen Mädchen'!A:A,MATCH(Übersicht!J:J,'Punkte-Wertetabellen Mädchen'!D:D,-1)), INDEX('Punkte-Wertetabellen Knaben'!A:A,MATCH(Übersicht!J:J,'Punkte-Wertetabellen Knaben'!D:D,-1)))","v":0},null,null,{"$f":"IF(Hilfsregister!$B$2=1, INDEX('Punkte-Wertetabellen Mädchen'!A:A,MATCH(Übersicht!M:M,'Punkte-Wertetabellen Mädchen'!E:E,-1)), INDEX('Punkte-Wertetabellen Knaben'!A:A,MATCH(Übersicht!M:M,'Punkte-Wertetabellen Knaben'!E:E,-1)))","v":0},null,null,{"$f":"IF(Hilfsregister!$B$2=1, INDEX('Punkte-Wertetabellen Mädchen'!A:A,MATCH(Übersicht!P:P,'Punkte-Wertetabellen Mädchen'!F:F,-1)), INDEX('Punkte-Wertetabellen Knaben'!A:A,MATCH(Übersicht!P:P,'Punkte-Wertetabellen Knaben'!F:F,-1)))","v":0},null,null,{"$f":"IF(S9=\"\",0,IF(Hilfsregister!$B$2=1, INDEX('Punkte-Wertetabellen Mädchen'!A:A,MATCH(Übersicht!S:S,'Punkte-Wertetabellen Mädchen'!G:G,1)), INDEX('Punkte-Wertetabellen Knaben'!A:A,MATCH(Übersicht!S:S,'Punkte-Wertetabellen Knaben'!G:G,1))))","v":0},"","",{"$f":"IF(OR(V9=\"\",V9=0),\"\",IF(Hilfsregister!$B$4=1, INDEX(Notentabellen!$A$5:$A$22,MATCH(V9,Notentabellen!$B$5:$B$35,-1)), IF(Hilfsregister!$B$4=2, INDEX(Notentabellen!$A$5:$A$22,MATCH(V9,Notentabellen!$C$5:$C$35,-1)), IF(Hilfsregister!$B$4=3, INDEX(Notentabellen!$A$5:$A$22,MATCH(V9,Notentabellen!$D$5:$D$35,-1)), IF(Hilfsregister!$B$4=4, INDEX(Notentabellen!$A$5:$A$22,MATCH(V9,Notentabellen!$E$5:$E$35,-1)), IF(Hilfsregister!$B$4=5, INDEX(Notentabellen!$A$5:$A$22,MATCH(V9,Notentabellen!$F$5:$F$35,-1)), IF(Hilfsregister!$B$4=6, INDEX(Notentabellen!$A$5:$A$22,MATCH(V9,Notentabellen!$G$5:$G$35,-1)),IF(Hilfsregister!$B$4=7, INDEX(Notentabellen!$A$5:$A$22,MATCH(V9,Notentabellen!$H$5:$H$35,-1)), IF(Hilfsregister!$B$4=8, INDEX(Notentabellen!$A$5:$A$22,MATCH(V9,Notentabellen!$I$5:$I$35,-1)),IF(Hilfsregister!$B$4=9,INDEX(Notentabellen!$A$5:$A$22,MATCH(V9,Notentabellen!$J$5:$J$35,-1)), IF(Hilfsregister!$B$4=10, INDEX(Notentabellen!$A$5:$A$22,MATCH(V9,Notentabellen!$K$5:$K$35,-1)), IF(Hilfsregister!$B$4=11, INDEX(Notentabellen!$A$5:$A$22,MATCH(V9,Notentabellen!$L$5:$L$35,-1)),IF(Hilfsregister!$B$4=12, INDEX(Notentabellen!$A$5:$A$22,MATCH(V9,Notentabellen!$M$5:$M$35,-1)))))))))))))))","v":""}]
[{"$nulls":5},{"$f":"IF(D10=\"\",0,IF(Hilfsregister!$B$2=1, INDEX('Punkte-Wertetabellen Mädchen'!A:A,MATCH(Übersicht!D:D,'Punkte-Wertetabellen Mädchen'!B:B)), INDEX('Punkte-Wertetabellen Knaben'!A:A,MATCH(Übersicht!D:D,'Punkte-Wertetabellen Knaben'!B:B))))","v":0},null,null,{"$f":"IF(Hilfsregister!$B$2 = 1, INDEX('Punkte-Wertetabellen Mädchen'!A:A,MATCH(Übersicht!G:G,'Punkte-Wertetabellen Mädchen'!C:C,-1)), INDEX('Punkte-Wertetabellen Knaben'!A:A,MATCH(Übersicht!G:G,'Punkte-Wertetabellen Knaben'!C:C,-1)))","v":0},null,null,{"$f":"IF(Hilfsregister!$B$2=1, INDEX('Punkte-Wertetabellen Mädchen'!A:A,MATCH(Übersicht!J:J,'Punkte-Wertetabellen Mädchen'!D:D,-1)), INDEX('Punkte-Wertetabellen Knaben'!A:A,MATCH(Übersicht!J:J,'Punkte-Wertetabellen Knaben'!D:D,-1)))","v":0},null,null,{"$f":"IF(Hilfsregister!$B$2=1, INDEX('Punkte-Wertetabellen Mädchen'!A:A,MATCH(Übersicht!M:M,'Punkte-Wertetabellen Mädchen'!E:E,-1)), INDEX('Punkte-Wertetabellen Knaben'!A:A,MATCH(Übersicht!M:M,'Punkte-Wertetabellen Knaben'!E:E,-1)))","v":0},null,null,{"$f":"IF(Hilfsregister!$B$2=1, INDEX('Punkte-Wertetabellen Mädchen'!A:A,MATCH(Übersicht!P:P,'Punkte-Wertetabellen Mädchen'!F:F,-1)), INDEX('Punkte-Wertetabellen Knaben'!A:A,MATCH(Übersicht!P:P,'Punkte-Wertetabellen Knaben'!F:F,-1)))","v":0},null,null,{"$f":"IF(S10=\"\",0,IF(Hilfsregister!$B$2=1, INDEX('Punkte-Wertetabellen Mädchen'!A:A,MATCH(Übersicht!S:S,'Punkte-Wertetabellen Mädchen'!G:G,1)), INDEX('Punkte-Wertetabellen Knaben'!A:A,MATCH(Übersicht!S:S,'Punkte-Wertetabellen Knaben'!G:G,1))))","v":0},"","",{"$f":"IF(OR(V10=\"\",V10=0),\"\",IF(Hilfsregister!$B$4=1, INDEX(Notentabellen!$A$5:$A$22,MATCH(V10,Notentabellen!$B$5:$B$35,-1)), IF(Hilfsregister!$B$4=2, INDEX(Notentabellen!$A$5:$A$22,MATCH(V10,Notentabellen!$C$5:$C$35,-1)), IF(Hilfsregister!$B$4=3, INDEX(Notentabellen!$A$5:$A$22,MATCH(V10,Notentabellen!$D$5:$D$35,-1)), IF(Hilfsregister!$B$4=4, INDEX(Notentabellen!$A$5:$A$22,MATCH(V10,Notentabellen!$E$5:$E$35,-1)), IF(Hilfsregister!$B$4=5, INDEX(Notentabellen!$A$5:$A$22,MATCH(V10,Notentabellen!$F$5:$F$35,-1)), IF(Hilfsregister!$B$4=6, INDEX(Notentabellen!$A$5:$A$22,MATCH(V10,Notentabellen!$G$5:$G$35,-1)),IF(Hilfsregister!$B$4=7, INDEX(Notentabellen!$A$5:$A$22,MATCH(V10,Notentabellen!$H$5:$H$35,-1)), IF(Hilfsregister!$B$4=8, INDEX(Notentabellen!$A$5:$A$22,MATCH(V10,Notentabellen!$I$5:$I$35,-1)),IF(Hilfsregister!$B$4=9,INDEX(Notentabellen!$A$5:$A$22,MATCH(V10,Notentabellen!$J$5:$J$35,-1)), IF(Hilfsregister!$B$4=10, INDEX(Notentabellen!$A$5:$A$22,MATCH(V10,Notentabellen!$K$5:$K$35,-1)), IF(Hilfsregister!$B$4=11, INDEX(Notentabellen!$A$5:$A$22,MATCH(V10,Notentabellen!$L$5:$L$35,-1)),IF(Hilfsregister!$B$4=12, INDEX(Notentabellen!$A$5:$A$22,MATCH(V10,Notentabellen!$M$5:$M$35,-1)))))))))))))))","v":""}]
{"$rows_left_out":92}
{"sheet":"Rangliste","index":2,"n_rows":100,"n_cols":5,"rows_kept":100,"merged":[[0,0,0,4],[1,0,1,1],[1,2,1,3]]}
["Leichtathletik-Sporttag"]
[{"$f":"IF(Hilfsregister!B2=1, \"Rangliste Mädchen\", IF(Hilfsregister!B2=2, \"Rangliste Knaben\"))","v":"Rangliste Knaben"},null,{"$f":"IF(E2=\"7. Klasse\",\"1. Sek\",IF(E2=\"8. Klasse\",\"2. Sek\",IF(E2=\"9. Klasse\",\"3. Sek\",\"\")))","v":"1. Sek"},null,{"$f":"Hilfsregister!B4 & \". Klasse\"","v":"7. Klasse"}]
[]
["Rang","Name","Vorname","Klasse","Gesamtpunkt-zahl"]
[{"$f":"IF(ROWS($A$5:A5)<=Hilfsregister!$F$2, SMALL(Übersicht!$W$7:$W$101,ROWS($A$5:A5)),\"\")","v":1},{"$f":"IF($A5=\"\",\"\",INDEX(Übersicht!$A$7:X101,_xlfn.AGGREGATE(15,6,ROW(Übersicht!$A$7:$C$101)-ROW(Übersicht!$W$7)+1/(Übersicht!$W$7:$W$101=Rangliste!A5),COUNTIF(Rangliste!$A$5:'Rangliste'!A5,Rangliste!A5)),1))","v":"Hans"},{"$f":"IF($A5=\"\",\"\",INDEX(Übersicht!$A$7:X101,_xlfn.AGGREGATE(15,6,ROW(Übersicht!$A$7:$C$101)-ROW(Übersicht!$W$7)+1/(Übersicht!$W$7:$W$101=Rangliste!A5),COUNTIF(Rangliste!$A$5:'Rangliste'!A5,Rangliste!A5)),2))","v":"Muster"},{"$f":"IF($A5=\"\",\"\",INDEX(Übersicht!$A$7:X101,_xlfn.AGGREGATE(15,6,ROW(Übersicht!$A$7:$C$101)-ROW(Übersicht!$W$7)+1/(Übersicht!$W$7:$W$101=Rangliste!A5),COUNTIF(Rangliste!$A$5:'Rangliste'!A5,Rangliste!A5)),3))","v":"1a"},{"$f":"IF($A5=\"\",\"\",INDEX(Übersicht!$A$7:X101,_xlfn.AGGREGATE(15,6,ROW(Übersicht!$A$7:$C$101)-ROW(Übersicht!$W$7)+1/(Übersicht!$W$7:$W$101=Rangliste!A5),COUNTIF(Rangliste!$A$5:'Rangliste'!A5,Rangliste!A5)),22))","v":68}]
[{"$f":"IF(ROWS($A$5:A6)<=Hilfsregister!$F$2, SMALL(Übersicht!$W$7:$W$101,ROWS($A$5:A6)),\"\")","v":""},{"$f":"IF($A6=\"\",\"\",INDEX(Übersicht!$A$7:X102,_xlfn.AGGREGATE(15,6,ROW(Übersicht!$A$7:$C$101)-ROW(Übersicht!$W$7)+1/(Übersicht!$W$7:$W$101=Rangliste!A6),COUNTIF(Rangliste!$A$5:'Rangliste'!A6,Rangliste!A6)),1))","v":""},{"$f":"IF($A6=\"\",\"\",INDEX(Übersicht!$A$7:X102,_xlfn.AGGREGATE(15,6,ROW(Übersicht!$A$7:$C$101)-ROW(Übersicht!$W$7)+1/(Übersicht!$W$7:$W$101=Rangliste!A6),COUNTIF(Rangliste!$A$5:'Rangliste'!A6,Rangliste!A6)),2))","v":""},{"$f":"IF($A6=\"\",\"\",INDEX(Übersicht!$A$7:X102,_xlfn.AGGREGATE(15,6,ROW(Übersicht!$A$7:$C$101)-ROW(Übersicht!$W$7)+1/(Übersicht!$W$7:$W$101=Rangliste!A6),COUNTIF(Rangliste!$A$5:'Rangliste'!A6,Rangliste!A6)),3))","v":""},{"$f":"IF($A6=\"\",\"\",INDEX(Übersicht!$A$7:X102,_xlfn.AGGREGATE(15,6,ROW(Übersicht!$A$7:$C$101)-ROW(Übersicht!$W$7)+1/(Übersicht!$W$7:$W$101=Rangliste!A6),COUNTIF(Rangliste!$A$5:'Rangliste'!A6,Rangliste!A6)),22))","v":""}]
[{"$f":"IF(ROWS($A$5:A7)<=Hilfsregister!$F$2, SMALL(Übersicht!$W$7:$W$101,ROWS($A$5:A7)),\"\")","v":""},{"$f":"IF($A7=\"\",\"\",INDEX(Übersicht!$A$7:X103,_xlfn.AGGREGATE(15,6,ROW(Übersicht!$A$7:$C$101)-ROW(Übersicht!$W$7)+1/(Übersicht!$W$7:$W$101=Rangliste!A7),COUNTIF(Rangliste!$A$5:'Rangliste'!A7,Rangliste!A7)),1))","v":""},{"$f":"IF($A7=\"\",\"\",INDEX(Übersicht!$A$7:X103,_xlfn.AGGREGATE(15,6,ROW(Übersicht!$A$7:$C$101)-ROW(Übersicht!$W$7)+1/(Übersicht!$W$7:$W$101=Rangliste!A7),COUNTIF(Rangliste!$A$5:'Rangliste'!A7,Rangliste!A7)),2))","v":""},{"$f":"IF($A7=\"\",\"\",INDEX(Übersicht!$A$7:X103,_xlfn.AGGREGATE(15,6,ROW(Übersicht!$A$7:$C$101)-ROW(Übersicht!$W$7)+1/(Übersicht!$W$7:$W$101=Rangliste!A7),COUNTIF(Rangliste!$A$5:'Rangliste'!A7,Rangliste!A7)),3))","v":""},{"$f":"IF($A7=\"\",\"\",INDEX(Übersicht!$A$7:X103,_xlfn.AGGREGATE(15,6,ROW(Übersicht!$A$7:$C$101)-ROW(Übersicht!$W$7)+1/(Übersicht!$W$7:$W$101=Rangliste!A7),COUNTIF(Rangliste!$A$5:'Rangliste'!A7,Rangliste!A7)),22))","v":""}]
[{"$f":"IF(ROWS($A$5:A8)<=Hilfsregister!$F$2, SMALL(Übersicht!$W$7:$W$101,ROWS($A$5:A8)),\"\")","v":""},{"$f":"IF($A8=\"\",\"\",INDEX(Übersicht!$A$7:X104,_xlfn.AGGREGATE(15,6,ROW(Übersicht!$A$7:$C$101)-ROW(Übersicht!$W$7)+1/(Übersicht!$W$7:$W$101=Rangliste!A8),COUNTIF(Rangliste!$A$5:'Rangliste'!A8,Rangliste!A8)),1))","v":""},{"$f":"IF($A8=\"\",\"\",INDEX(Übersicht!$A$7:X104,_xlfn.AGGREGATE(15,6,ROW(Übersicht!$A$7:$C$101)-ROW(Übersicht!$W$7)+1/(Übersicht!$W$7:$W$101=Rangliste!A8),COUNTIF(Rangliste!$A$5:'Rangliste'!A8,Rangliste!A8)),2))","v":""},{"$f":"IF($A8=\"\",\"\",INDEX(Übersicht!$A$7:X104,_xlfn.AGGREGATE(15,6,ROW(Übersicht!$A$7:$C$101)-ROW(Übersicht!$W$7)+1/(Übersicht!$W$7:$W$101=Rangliste!A8),COUNTIF(Rangliste!$A$5:'Rangliste'!A8,Rangliste!A8)),3))","v":""},{"$f":"IF($A8=\"\",\"\",INDEX(Übersicht!$A$7:X104,_xlfn.AGGREGATE(15,6,ROW(Übersicht!$A$7:$C$101)-ROW(Übersicht!$W$7)+1/(Übersicht!$W$7:$W$101=Rangliste!A8),COUNTIF(Rangliste!$A$5:'Rangliste'!A8,Rangliste!A8)),22))","v":""}]
[{"$f":"IF(ROWS($A$5:A9)<=Hilfsregister!$F$2, SMALL(Übersicht!$W$7:$W$101,ROWS($A$5:A9)),\"\")","v":""},{"$f":"IF($A9=\"\",\"\",INDEX(Übersicht!$A$7:X105,_xlfn.AGGREGATE(15,6,ROW(Übersicht!$A$7:$C$101)-ROW(Übersicht!$W$7)+1/(Übersicht!$W$7:$W$101=Rangliste!A9),COUNTIF(Rangliste!$A$5:'Rangliste'!A9,Rangliste!A9)),1))","v":""},{"$f":"IF($A9=\"\",\"\",INDEX(Übersicht!$A$7:X105,_xlfn.AGGREGATE(15,6,ROW(Übersicht!$A$7:$C$101)-ROW(Übersicht!$W$7)+1/(Übersicht!$W$7:$W$101=Rangliste!A9),COUNTIF(Rangliste!$A$5:'Rangliste'!A9,Rangliste!A9)),2))","v":""},{"$f":"IF($A9=\"\",\"\",INDEX(Übersicht!$A$7:X105,_xlfn.AGGREGATE(15,6,ROW(Übersicht!$A$7:$C$101)-ROW(Übersicht!$W$7)+1/(Übersicht!$W$7:$W$101=Rangliste!A9),COUNTIF(Rangliste!$A$5:'Rangliste'!A9,Rangliste!A9)),3))","v":""},{"$f":"IF($A9=\"\",\"\",INDEX(Übersicht!$A$7:X105,_xlfn.AGGREGATE(15,6,ROW(Übersicht!$A$7:$C$101)-ROW(Übersicht!$W$7)+1/(Übersicht!$W$7:$W$101=Rangliste!A9),COUNTIF(Rangliste!$A$5:'Rangliste'!A9,Rangliste!A9)),22))","v":""}]
[{"$f":"IF(ROWS($A$5:A10)<=Hilfsregister!$F$2, SMALL(Übersicht!$W$7:$W$101,ROWS($A$5:A10)),\"\")","v":""},{"$f":"IF($A10=\"\",\"\",INDEX(Übersicht!$A$7:X106,_xlfn.AGGREGATE(15,6,ROW(Übersicht!$A$7:$C$101)-ROW(Übersicht!$W$7)+1/(Übersicht!$W$7:$W$101=Rangliste!A10),COUNTIF(Rangliste!$A$5:'Rangliste'!A10,Rangliste!A10)),1))","v":""},{"$f":"IF($A10=\"\",\"\",INDEX(Übersicht!$A$7:X106,_xlfn.AGGREGATE(15,6,ROW(Übersicht!$A$7:$C$101)-ROW(Übersicht!$W$7)+1/(Übersicht!$W$7:$W$101=Rangliste!A10),COUNTIF(Rangliste!$A$5:'Rangliste'!A10,Rangliste!A10)),2))","v":""},{"$f":"IF($A10=\"\",\"\",INDEX(Übersicht!$A$7:X106,_xlfn.AGGREGATE(15,6,ROW(Übersicht!$A$7:$C$101)-ROW(Übersicht!$W$7)+1/(Übersicht!$W$7:$W$101=Rangliste!A10),COUNTIF(Rangliste!$A$5:'Rangliste'!A10,Rangliste!A10)),3))","v":""},{"$f":"IF($A10=\"\",\"\",INDEX(Übersicht!$A$7:X106,_xlfn.AGGREGATE(15,6,ROW(Übersicht!$A$7:$C$101)-ROW(Übersicht!$W$7)+1/(Übersicht!$W$7:$W$101=Rangliste!A10),COUNTIF(Rangliste!$A$5:'Rangliste'!A10,Rangliste!A10)),22))","v":""}]
{"$rows_left_out":91}
{"sheet":"Punkte-Wertetabellen Mädchen","index":3,"n_rows":32,"n_cols":7,"rows_kept":32,"merged":[[0,0,0,6],[1,0,1,2],[2,0,2,6],[3,0,3,6]]}
["Leichtathletik-Sporttag-Erfassungstool"]
["Punkte- & Wertetabellen Mädchen\n"]
["erstellt von Roman Marxer (romanmarxer@hotmail.com)"]
["Anmerkung: Die Punkte-& Wertetabellen können editiert werden, indem neue Werte hineingeschrieben werden!"]
[]
["Punkte:","80m-Lauf","Hochsprung","Weitsprung","Weitwurf","Kugelstossen","2000m-Lauf"]
[20,5,2,7,100,20,"03:30:00"]
[20,10,2,7,100,20,"03:30:00"]
[19,10.51,1.44,4.79,39.99,9.99,"08:01:00"]
[18,10.61,1.44,4.64,37.99,9.54,"08:13:00"]
{"$rows_left_out":23}
{"sheet":"Punkte-Wertetabellen Knaben","index":4,"n_rows":45,"n_cols":7,"rows_kept":45,"merged":[[0,0,0,6],[1,0,1,6],[2,0,2,6],[3,0,3,6],[44,0,44,1]]}
["Leichtathletik-Sporttag-Erfassungstool"]
["Punkte- & Wertetabellen Knaben\n"]
["erstellt von Roman Marxer (romanmarxer@hotmail.com)"]
["Anmerkung: Die Punkte-& Wertetabellen können editiert werden, indem neue Werte hineingeschrieben werden!"]
[]
["Punkte:","80m-Lauf","Hochsprung","Weitsprung","Weitwurf","Kugelstossen","2000m-Lauf"]
[20,5,2,7,100,20,"03:30:00"]
[20,10,2,7,100,20,"04:30:00"]
[19,10.1,1.64,5.49,57.99,11.99,"07:01:00"]
[18,10.21,1.64,5.34,54.99,11.49,"07:13:00"]
{"$rows_left_out":22}
{"sheet":"Notentabellen","index":5,"n_rows":24,"n_cols":13,"rows_kept":24,"merged":[[0,0,0,12],[1,0,1,12],[2,0,2,6]]}
["Leichtathletik-Sporttag-Erfassungstool"]
["Notentabellen\n"]
["erstellt von Roman Marxer (romanmarxer@hotmail.com)"]
["Anmerkung: Werte sind nur für die Sekundarjahre eingetragen. In gleicher Weise können die Werte aber für die anderen Jahre eingetragen werden!"]
["Note","Für Note zu erreichende Punktzahl"]
[null,"1. Klasse","2. Klasse","3. Klasse","4. Klasse","5. Klasse","6. Klasse","7. Klasse","8. Klasse","9. Klasse","10. Klasse","11. Klasse","12. Klasse"]
[6,120,120,120,120,120,120,120,120,120,120,120,120]
[5.75,{"$nulls":6},85,92,99]
[5.5,{"$nulls":6},75,85,92]
[5.25,{"$nulls":6},68,75,85]
{"$rows_left_out":15}
{"sheet":"Laufzettel","index":6,"n_rows":0,"n_cols":0,"rows_kept":0}

{"sheet":"Hilfsregister","index":7,"n_rows":15,"n_cols":6,"rows_kept":15,"hidden":true}
["Hilfsfelder:",null,null,"Rangliste:","Platzierung","Anzahl"]
["Mädchen",2,null,"Top 10",10,{"$f":"COUNTIF(Übersicht!W7:W101, \"<=\"&Hilfsregister!E2*10)","v":1}]
["Knaben",null,null,"Top 20"]
["1. Klasse",7,null,"Top 30"]
["2. Klasse",null,null,"Top 40"]
["3. Klasse",null,null,"Top 50"]
["4. Klasse",null,null,"Top 60"]
["5. Klasse",null,null,"Top 70"]
["6. Klasse",null,null,"Top 80"]
["7. Klasse (1. Sek)",null,null,"Top 90"]
{"$rows_left_out":5}