{"text_format":"1","workbook":"xlsx","n_sheets":6,"sheets":["Anleitung","Eingabefeld","Laufliste","Rangliste","Notentabellen","Hilfsregister"],"not_rendered":{"charts":0,"images":0,"macros":1,"external_links":0,"defined_names":0,"comments":0,"pivot_tables":0},"unopened":[],"bounds":{"document_bytes":16777216,"sheet_cells":100000,"rows_first":2000,"rows_last":500,"rows_between":2000,"halvings":0,"cell_chars":16384,"cell_head_chars":4096},"cells_cut":0,"cells_raw":0,"read":"whole","date_system":"1900"}

{"sheet":"Anleitung","index":0,"n_rows":7,"n_cols":1,"rows_kept":7,"cut":false,"hidden":false,"merged":[[6,0,6,18],[3,0,3,18],[4,0,4,18],[0,0,0,11],[1,0,1,18],[2,0,2,18],[5,0,5,18]]}
["Parkour-Hindernislauf-Messtool Anleitung\nerstellt von Roman Marxer (romanmarxer@hotmail.com)"]
["Zweck und Beschreibung des Programms:"]
["Dieses Programm dient der effizienteren Durchführung und Auswertung von Parkours und Hindernisläufen. Das Programm wurde an verschiedenen Klassen getestet und hat sich aus folgenden Gründen bewährt:\n- Einfache Erfassung von Start/Zielzeiten sowie Strafpunkten und Zeitstrafen pro Strafpunkt möglich\n- Errechnet automatisch Laufzeiten, Ranglisten, Noten und Notendurchschnitte\n- Einfügen von Schülerdaten direkt aus bestehenden Listen und dem Lehreroffice\n- Zeiten, Noten und Notendurchschnitte sind ausblendbar; Notenskalen können angepasst werden\n- Export der Daten in Leheroffice, etc. möglich"]
["Gebrauchsanleitung:"]
["1. Füge im Registerblatt \"Eingabefeld\" die Liste der LäuferInnen ein, indem du die Namen in der Spalte \"Name des Läufer/der Läuferin\" notierst. Du kannst die Daten direkt aus einer bestehenden Listen oder dem Lehreroffice hineinkopieren.\n2. Du hast die Möglichkeit den Lernenden beim Durchlaufen des Parkours Strafpunkte zu geben, falls sie Abkürzen oder Geräte unkorrekt überqueren. Die Strafzeit pro Strafpunkt kannst du im Registerblatt \"Eingabefeld\" in der Zelle F4 eingeben (in Sekunden).\n3. Erfasse nun die Startzeit der Läufer im Registerblatt \"Eingabefeld\". Dies kannst du auf zwei Arten machen:\n            - Eingabe via Schaltfläche \"Startzeitenerfassung\"\n            - Durch anklicken der Zelle mit der entsprechenden Startnummer in Spalte C\n    Als Startzeit wird die Systemzeit des Computers genommen. Diese wird automatisch in der Laufliste eingetragen.\n4. Erfasse die Zielzeiten der LäuferInnen, die beim Ziel ankommen. Auch dies kannst du auf zwei Arten machen:\n            - Eingabe via Schaltfläche \"Zielzeitenerfassung\"\n            - Durch anklicken der Zelle mit der entsprechenden Startnummer Spalte D\n    Als Zielzeit wird die Systemzeit des Computers genommen. Diese wird automatisch in der Laufliste eingetragen. \n5. Verteile falls nötig Strafpunkte. Diese kannst du auch im Registerblatt \"Eingabefeld\" in der Spalte E einfügen."]
["Anmerkung: Ich lasse die Lernenden jeweils mit einem Abstand von etwa 20s in den Hindernisparkour starten und nutze die zweite Art der Start- und Zielzeiterfassung. Dieses Vorgehen hat den Vorteil, dass das Durchlaufen des Hindernisparkours insgesamt wesentlich weniger Zeit in Anspruch nimmt. Für 20 Schülerinnen und Schüler dauert das Erfassen des Hindernislaufs so etwa 10 Minuten.\n\n6. Durch wählen der Sekundarstufe und des Geschlechts wird die passende Notentabelle aktiviert. Die Notentabellen können im Blatt \"Notentabellen\" eingesehen und bearbeitet werden.\n5. Die Rangliste mit Noten ist im Registerblatt \"Rangliste\" ersichtlich. Die Noten- und Zeitenspalten können ausgeblendet werden.\n6. Um Noten direkt ins Leheroffice zu kopieren, kannst du im Registerblatt \"Laufliste\" die Noten herauskopieren.\n\nDieses Programm wurde von mir in meiner Freizeit entwickelt und hat mich einige Zeit und Nerven gekostet. Falls dir das Programm bei der Durchführung von Parkours oder Hindernisläufen hilft und du es regelmässig einsetzt, würde ich mich über eine kleine Spende von dir, deiner Schule oder deinem Verein freuen! Vielen Dank!\n\nRoman Marxer, IBAN: CH74 0070 0112 3000 7491 9, Konto-Nr.: 1123-0074.919 , Zahlungszweck: Spende Parkour-Hindernislauf-Messtool\n\nBei Fragen, Anmerkungen und Verbesserungsvorschlägen kannst du mich gerne per Mail kontaktieren: romanmarxer@hotmail.com\n\n"]
["Version 2.0, Juni 2017"]

{"sheet":"Eingabefeld","index":1,"n_rows":103,"n_cols":6,"rows_kept":103,"cut":false,"hidden":false,"merged":[[1,0,1,3],[0,0,0,3]]}
["Eingabefeld\nerstellt von Roman Marxer (romanmarxer@hotmail.com)"]
["Bemerkung/Anleitung: Hier werden alle relevanten Daten wie LäuferInnen, Start-, und Zielzeiten sowie Strafzeiten und Strafpunkte erfasst. Alle Daten werden automatisch in der Laufliste und der Rangliste aktualisiert.\n\nDie Erfassung der Start und Zielzeit kann auf zwei Arten erfolgen:\n1. Eingabe via Schaltflächen rechts\n2. Durch anklicken der Zelle mit der entsprechenden Startnummer in Spalte C bzw. Spalte D (Wenn Zeit gesetzt, wird Zelle grün)\n\nDurch wählen der Sekundarstufe und des Geschlechts wird  die passende Notentabelle aktiviert. Die Notentabellen können im Blatt \"Notentabellen\" bearbeitet werden. Die Ranglisten sind in den entsprechenden Registerblättern ersichtlich!\n\n\n",null,null,null,"Sekundarstufe durch anklicken wählen","Geschlecht durch anklicken wählen"]
["Startnummer","Name des Läufers/der Läuferin","Klicke auf die Nummern in dieser Spalte, um die Startzeit zu setzten","Klicke auf die Nummern in dieser Spalte, um die Zielzeit zu setzten!","Anzahl Strafpunkte des Läufers/der Läuferin","Zeitstrafe pro Strafpunkt in Sekunden in Zelle unten einfügen"]
[1,null,1,1,null,5]
[2,null,2,2]
[3,null,3,3]
[4,null,4,4]
[5,null,5,5]
[6,null,6,6]
[7,null,7,7]
{"$rows_left_out":94}
{"sheet":"Laufliste","index":2,"n_rows":102,"n_cols":9,"rows_kept":102,"cut":false,"hidden":false,"merged":[[0,0,0,3]]}
["Laufliste\nerstellt von Roman Marxer (romanmarxer@hotmail.com)"]
["Nr.","Läufer/in","Startzeit","Zielzeit","Strafpunke","Zeitstrafe in Sekunden","Laufzeit + Strafzeit","Note","Notendurchschnitt"]
[1,{"$f":"IF(Eingabefeld!B4= \"\", \" \",INDEX(Eingabefeld!B:B,MATCH(A:A,Eingabefeld!A:A,0)))","v":" "},null,null,{"$f":"IF(Eingabefeld!E4=\"\",0,Eingabefeld!E4)","v":0},{"$f":"E3*Eingabefeld!$F$4","v":0},{"$f":"IF(OR(C3<0,D3=0,D3-C3<0),\"\",D3-C3+F3/24/60/60)","v":""},{"$f":"IF(G3 = \"\", \" \", IF(AND(Notentabellen!$J$3=1,Notentabellen!$L$3=1),INDEX(Notentabellen!B:B,MATCH(G:G,Notentabellen!A:A,1)),IF(AND(Notentabellen!$J$3=1,Notentabellen!$L$3=2),INDEX(Notentabellen!C:C,MATCH(G:G,Notentabellen!A:A,1)),IF(AND(Notentabellen!$J$3=2,Notentabellen!$L$3=1),INDEX(Notentabellen!D:D,MATCH(G:G,Notentabellen!A:A,1)),IF(AND(Notentabellen!$J$3=2,Notentabellen!$L$3=2),INDEX(Notentabellen!E:E,MATCH(G:G,Notentabellen!A:A,1)),IF(AND(Notentabellen!$J$3 =3,Notentabellen!$L$3=1), INDEX(Notentabellen!F:F,MATCH(G:G,Notentabellen!A:A,1)), IF(AND(Notentabellen!$J$3 =3,Notentabellen!$L$3=2), INDEX(Notentabellen!G:G,MATCH(G:G,Notentabellen!A:A,1)))))))))","v":" "},{"$f":"AVERAGE(H3:H102)","v":{"$error":"#DIV/0!"}}]
[2,{"$f":"IF(Eingabefeld!B5= \"\", \" \",INDEX(Eingabefeld!B:B,MATCH(A:A,Eingabefeld!A:A,0)))","v":" "},null,null,{"$f":"IF(Eingabefeld!E5=\"\",0,Eingabefeld!E5)","v":0},{"$f":"E4*Eingabefeld!$F$4","v":0},{"$f":"IF(OR(C4<0,D4=0,D4-C4<0),\"\",D4-C4+F4/24/60/60)","v":""},{"$f":"IF(G4 = \"\", \" \", IF(AND(Notentabellen!$J$3=1,Notentabellen!$L$3=1),INDEX(Notentabellen!B:B,MATCH(G:G,Notentabellen!A:A,1)),IF(AND(Notentabellen!$J$3=1,Notentabellen!$L$3=2),INDEX(Notentabellen!C:C,MATCH(G:G,Notentabellen!A:A,1)),IF(AND(Notentabellen!$J$3=2,Notentabellen!$L$3=1),INDEX(Notentabellen!D:D,MATCH(G:G,Notentabellen!A:A,1)),IF(AND(Notentabellen!$J$3=2,Notentabellen!$L$3=2),INDEX(Notentabellen!E:E,MATCH(G:G,Notentabellen!A:A,1)),IF(AND(Notentabellen!$J$3 =3,Notentabellen!$L$3=1), INDEX(Notentabellen!F:F,MATCH(G:G,Notentabellen!A:A,1)), IF(AND(Notentabellen!$J$3 =3,Notentabellen!$L$3=2), INDEX(Notentabellen!G:G,MATCH(G:G,Notentabellen!A:A,1)))))))))","v":" "}]
[3,{"$f":"IF(Eingabefeld!B6= \"\", \" \",INDEX(Eingabefeld!B:B,MATCH(A:A,Eingabefeld!A:A,0)))","v":" "},null,null,{"$f":"IF(Eingabefeld!E6=\"\",0,Eingabefeld!E6)","v":0},{"$f":"E5*Eingabefeld!$F$4","v":0},"",{"$f":"IF(G5 = \"\", \" \", IF(AND(Notentabellen!$J$3=1,Notentabellen!$L$3=1),INDEX(Notentabellen!B:B,MATCH(G:G,Notentabellen!A:A,1)),IF(AND(Notentabellen!$J$3=1,Notentabellen!$L$3=2),INDEX(Notentabellen!C:C,MATCH(G:G,Notentabellen!A:A,1)),IF(AND(Notentabellen!$J$3=2,Notentabellen!$L$3=1),INDEX(Notentabellen!D:D,MATCH(G:G,Notentabellen!A:A,1)),IF(AND(Notentabellen!$J$3=2,Notentabellen!$L$3=2),INDEX(Notentabellen!E:E,MATCH(G:G,Notentabellen!A:A,1)),IF(AND(Notentabellen!$J$3 =3,Notentabellen!$L$3=1), INDEX(Notentabellen!F:F,MATCH(G:G,Notentabellen!A:A,1)), IF(AND(Notentabellen!$J$3 =3,Notentabellen!$L$3=2), INDEX(Notentabellen!G:G,MATCH(G:G,Notentabellen!A:A,1)))))))))","v":" "}]
[4,{"$f":"IF(Eingabefeld!B7= \"\", \" \",INDEX(Eingabefeld!B:B,MATCH(A:A,Eingabefeld!A:A,0)))","v":" "},null,null,{"$f":"IF(Eingabefeld!E7=\"\",0,Eingabefeld!E7)","v":0},{"$f":"E6*Eingabefeld!$F$4","v":0},"",{"$f":"IF(G6 = \"\", \" \", IF(AND(Notentabellen!$J$3=1,Notentabellen!$L$3=1),INDEX(Notentabellen!B:B,MATCH(G:G,Notentabellen!A:A,1)),IF(AND(Notentabellen!$J$3=1,Notentabellen!$L$3=2),INDEX(Notentabellen!C:C,MATCH(G:G,Notentabellen!A:A,1)),IF(AND(Notentabellen!$J$3=2,Notentabellen!$L$3=1),INDEX(Notentabellen!D:D,MATCH(G:G,Notentabellen!A:A,1)),IF(AND(Notentabellen!$J$3=2,Notentabellen!$L$3=2),INDEX(Notentabellen!E:E,MATCH(G:G,Notentabellen!A:A,1)),IF(AND(Notentabellen!$J$3 =3,Notentabellen!$L$3=1), INDEX(Notentabellen!F:F,MATCH(G:G,Notentabellen!A:A,1)), IF(AND(Notentabellen!$J$3 =3,Notentabellen!$L$3=2), INDEX(Notentabellen!G:G,MATCH(G:G,Notentabellen!A:A,1)))))))))","v":" "}]
[5,{"$f":"IF(Eingabefeld!B8= \"\", \" \",INDEX(Eingabefeld!B:B,MATCH(A:A,Eingabefeld!A:A,0)))","v":" "},null,null,{"$f":"IF(Eingabefeld!E8=\"\",0,Eingabefeld!E8)","v":0},{"$f":"E7*Eingabefeld!$F$4","v":0},"",{"$f":"IF(G7 = \"\", \" \", IF(AND(Notentabellen!$J$3=1,Notentabellen!$L$3=1),INDEX(Notentabellen!B:B,MATCH(G:G,Notentabellen!A:A,1)),IF(AND(Notentabellen!$J$3=1,Notentabellen!$L$3=2),INDEX(Notentabellen!C:C,MATCH(G:G,Notentabellen!A:A,1)),IF(AND(Notentabellen!$J$3=2,Notentabellen!$L$3=1),INDEX(Notentabellen!D:D,MATCH(G:G,Notentabellen!A:A,1)),IF(AND(Notentabellen!$J$3=2,Notentabellen!$L$3=2),INDEX(Notentabellen!E:E,MATCH(G:G,Notentabellen!A:A,1)),IF(AND(Notentabellen!$J$3 =3,Notentabellen!$L$3=1), INDEX(Notentabellen!F:F,MATCH(G:G,Notentabellen!A:A,1)), IF(AND(Notentabellen!$J$3 =3,Notentabellen!$L$3=2), INDEX(Notentabellen!G:G,MATCH(G:G,Notentabellen!A:A,1)))))))))","v":" "}]
[6,{"$f":"IF(Eingabefeld!B9= \"\", \" \",INDEX(Eingabefeld!B:B,MATCH(A:A,Eingabefeld!A:A,0)))","v":" "},null,null,{"$f":"IF(Eingabefeld!E9=\"\",0,Eingabefeld!E9)","v":0},{"$f":"E8*Eingabefeld!$F$4","v":0},"",{"$f":"IF(G8 = \"\", \" \", IF(AND(Notentabellen!$J$3=1,Notentabellen!$L$3=1),INDEX(Notentabellen!B:B,MATCH(G:G,Notentabellen!A:A,1)),IF(AND(Notentabellen!$J$3=1,Notentabellen!$L$3=2),INDEX(Notentabellen!C:C,MATCH(G:G,Notentabellen!A:A,1)),IF(AND(Notentabellen!$J$3=2,Notentabellen!$L$3=1),INDEX(Notentabellen!D:D,MATCH(G:G,Notentabellen!A:A,1)),IF(AND(Notentabellen!$J$3=2,Notentabellen!$L$3=2),INDEX(Notentabellen!E:E,MATCH(G:G,Notentabellen!A:A,1)),IF(AND(Notentabellen!$J$3 =3,Notentabellen!$L$3=1), INDEX(Notentabellen!F:F,MATCH(G:G,Notentabellen!A:A,1)), IF(AND(Notentabellen!$J$3 =3,Notentabellen!$L$3=2), INDEX(Notentabellen!G:G,MATCH(G:G,Notentabellen!A:A,1)))))))))","v":" "}]
[7,{"$f":"IF(Eingabefeld!B10= \"\", \" \",INDEX(Eingabefeld!B:B,MATCH(A:A,Eingabefeld!A:A,0)))","v":" "},null,null,{"$f":"IF(Eingabefeld!E10=\"\",0,Eingabefeld!E10)","v":0},{"$f":"E9*Eingabefeld!$F$4","v":0},"",{"$f":"IF(G9 = \"\", \" \", IF(AND(Notentabellen!$J$3=1,Notentabellen!$L$3=1),INDEX(Notentabellen!B:B,MATCH(G:G,Notentabellen!A:A,1)),IF(AND(Notentabellen!$J$3=1,Notentabellen!$L$3=2),INDEX(Notentabellen!C:C,MATCH(G:G,Notentabellen!A:A,1)),IF(AND(Notentabellen!$J$3=2,Notentabellen!$L$3=1),INDEX(Notentabellen!D:D,MATCH(G:G,Notentabellen!A:A,1)),IF(AND(Notentabellen!$J$3=2,Notentabellen!$L$3=2),INDEX(Notentabellen!E:E,MATCH(G:G,Notentabellen!A:A,1)),IF(AND(Notentabellen!$J$3 =3,Notentabellen!$L$3=1), INDEX(Notentabellen!F:F,MATCH(G:G,Notentabellen!A:A,1)), IF(AND(Notentabellen!$J$3 =3,Notentabellen!$L$3=2), INDEX(Notentabellen!G:G,MATCH(G:G,Notentabellen!A:A,1)))))))))","v":" "}]
[8,{"$f":"IF(Eingabefeld!B11= \"\", \" \",INDEX(Eingabefeld!B:B,MATCH(A:A,Eingabefeld!A:A,0)))","v":" "},null,null,{"$f":"IF(Eingabefeld!E11=\"\",0,Eingabefeld!E11)","v":0},{"$f":"E10*Eingabefeld!$F$4","v":0},"",{"$f":"IF(G10 = \"\", \" \", IF(AND(Notentabellen!$J$3=1,Notentabellen!$L$3=1),INDEX(Notentabellen!B:B,MATCH(G:G,Notentabellen!A:A,1)),IF(AND(Notentabellen!$J$3=1,Notentabellen!$L$3=2),INDEX(Notentabellen!C:C,MATCH(G:G,Notentabellen!A:A,1)),IF(AND(Notentabellen!$J$3=2,Notentabellen!$L$3=1),INDEX(Notentabellen!D:D,MATCH(G:G,Notentabellen!A:A,1)),IF(AND(Notentabellen!$J$3=2,Notentabellen!$L$3=2),INDEX(Notentabellen!E:E,MATCH(G:G,Notentabellen!A:A,1)),IF(AND(Notentabellen!$J$3 =3,Notentabellen!$L$3=1), INDEX(Notentabellen!F:F,MATCH(G:G,Notentabellen!A:A,1)), IF(AND(Notentabellen!$J$3 =3,Notentabellen!$L$3=2), INDEX(Notentabellen!G:G,MATCH(G:G,Notentabellen!A:A,1)))))))))","v":" "}]
{"$rows_left_out":93}
{"sheet":"Rangliste","index":3,"n_rows":103,"n_cols":5,"rows_kept":103,"cut":false,"hidden":false,"merged":[[0,0,0,4],[1,0,1,4]]}
["Rangliste"]
["Anmerkung: Zeiten, Noten und Notenschnitt (und diese Bemerkung) können ausgeblendet werden, indem die entsprechenden Spalten (bzw. diese Zeile) ausgeblendet werden!"]
["Rang","Läufer/in","Laufzeit + Strafzeit","Note","Notenschnitt"]
[{"$f":"IF(C4=\"\",\"\",_xlfn.RANK.EQ(C4,C:C,1))","v":""},{"$f":"IF(C4=\"\",\"\",INDEX(Laufliste!B:B,_xlfn.AGGREGATE(15,6,ROW(Laufliste!G:G)/(Laufliste!G:G=C4),COUNTIF($C$4:C4,C4)),1))","v":""},{"$f":"IF(ISERROR(_xlfn.AGGREGATE(15,6,Laufliste!G:G,ROW()-3)),\"\",IF(ROWS($A$4:A4)<=Hilfsregister!$C$2,_xlfn.AGGREGATE(15,6,Laufliste!G:G,ROW()-3),\"\"))","v":""},{"$f":"IF(C4 = \"\", \"\", IF(AND(Notentabellen!$J$3=1,Notentabellen!$L$3=1),INDEX(Notentabellen!B:B,MATCH(C:C,Notentabellen!A:A,1)),IF(AND(Notentabellen!$J$3=1,Notentabellen!$L$3=2),INDEX(Notentabellen!C:C,MATCH(C:C,Notentabellen!A:A,1)),IF(AND(Notentabellen!$J$3=2,Notentabellen!$L$3=1),INDEX(Notentabellen!D:D,MATCH(C:C,Notentabellen!A:A,1)),IF(AND(Notentabellen!$J$3=2,Notentabellen!$L$3=2),INDEX(Notentabellen!E:E,MATCH(C:C,Notentabellen!A:A,1)),IF(AND(Notentabellen!$J$3 =3,Notentabellen!$L$3=1), INDEX(Notentabellen!F:F,MATCH(C:C,Notentabellen!A:A,1)), IF(AND(Notentabellen!$J$3 =3,Notentabellen!$L$3=2), INDEX(Notentabellen!G:G,MATCH(C:C,Notentabellen!A:A,1)))))))))","v":""},{"$f":"AVERAGE(D4:D103)","v":{"$error":"#DIV/0!"}}]
[{"$f":"IF(C5=\"\",\"\",_xlfn.RANK.EQ(C5,C:C,1))","v":""},{"$f":"IF(C5=\"\",\"\",INDEX(Laufliste!B:B,_xlfn.AGGREGATE(15,6,ROW(Laufliste!G:G)/(Laufliste!G:G=C5),COUNTIF($C$4:C5,C5)),1))","v":""},{"$f":"IF(ISERROR(_xlfn.AGGREGATE(15,6,Laufliste!G:G,ROW()-3)),\"\",IF(ROWS($A$4:A5)<=Hilfsregister!$C$2,_xlfn.AGGREGATE(15,6,Laufliste!G:G,ROW()-3),\"\"))","v":""},{"$f":"IF(C5 = \"\", \"\", IF(AND(Notentabellen!$J$3=1,Notentabellen!$L$3=1),INDEX(Notentabellen!B:B,MATCH(C:C,Notentabellen!A:A,1)),IF(AND(Notentabellen!$J$3=1,Notentabellen!$L$3=2),INDEX(Notentabellen!C:C,MATCH(C:C,Notentabellen!A:A,1)),IF(AND(Notentabellen!$J$3=2,Notentabellen!$L$3=1),INDEX(Notentabellen!D:D,MATCH(C:C,Notentabellen!A:A,1)),IF(AND(Notentabellen!$J$3=2,Notentabellen!$L$3=2),INDEX(Notentabellen!E:E,MATCH(C:C,Notentabellen!A:A,1)),IF(AND(Notentabellen!$J$3 =3,Notentabellen!$L$3=1), INDEX(Notentabellen!F:F,MATCH(C:C,Notentabellen!A:A,1)), IF(AND(Notentabellen!$J$3 =3,Notentabellen!$L$3=2), INDEX(Notentabellen!G:G,MATCH(C:C,Notentabellen!A:A,1)))))))))","v":""}]
["",{"$f":"IF(C6=\"\",\"\",INDEX(Laufliste!B:B,_xlfn.AGGREGATE(15,6,ROW(Laufliste!G:G)/(Laufliste!G:G=C6),COUNTIF($C$4:C6,C6)),1))","v":""},{"$f":"IF(ISERROR(_xlfn.AGGREGATE(15,6,Laufliste!G:G,ROW()-3)),\"\",IF(ROWS($A$4:A6)<=Hilfsregister!$C$2,_xlfn.AGGREGATE(15,6,Laufliste!G:G,ROW()-3),\"\"))","v":""},{"$f":"IF(C6 = \"\", \"\", IF(AND(Notentabellen!$J$3=1,Notentabellen!$L$3=1),INDEX(Notentabellen!B:B,MATCH(C:C,Notentabellen!A:A,1)),IF(AND(Notentabellen!$J$3=1,Notentabellen!$L$3=2),INDEX(Notentabellen!C:C,MATCH(C:C,Notentabellen!A:A,1)),IF(AND(Notentabellen!$J$3=2,Notentabellen!$L$3=1),INDEX(Notentabellen!D:D,MATCH(C:C,Notentabellen!A:A,1)),IF(AND(Notentabellen!$J$3=2,Notentabellen!$L$3=2),INDEX(Notentabellen!E:E,MATCH(C:C,Notentabellen!A:A,1)),IF(AND(Notentabellen!$J$3 =3,Notentabellen!$L$3=1), INDEX(Notentabellen!F:F,MATCH(C:C,Notentabellen!A:A,1)), IF(AND(Notentabellen!$J$3 =3,Notentabellen!$L$3=2), INDEX(Notentabellen!G:G,MATCH(C:C,Notentabellen!A:A,1)))))))))","v":""}]
["",{"$f":"IF(C7=\"\",\"\",INDEX(Laufliste!B:B,_xlfn.AGGREGATE(15,6,ROW(Laufliste!G:G)/(Laufliste!G:G=C7),COUNTIF($C$4:C7,C7)),1))","v":""},{"$f":"IF(ISERROR(_xlfn.AGGREGATE(15,6,Laufliste!G:G,ROW()-3)),\"\",IF(ROWS($A$4:A7)<=Hilfsregister!$C$2,_xlfn.AGGREGATE(15,6,Laufliste!G:G,ROW()-3),\"\"))","v":""},{"$f":"IF(C7 = \"\", \"\", IF(AND(Notentabellen!$J$3=1,Notentabellen!$L$3=1),INDEX(Notentabellen!B:B,MATCH(C:C,Notentabellen!A:A,1)),IF(AND(Notentabellen!$J$3=1,Notentabellen!$L$3=2),INDEX(Notentabellen!C:C,MATCH(C:C,Notentabellen!A:A,1)),IF(AND(Notentabellen!$J$3=2,Notentabellen!$L$3=1),INDEX(Notentabellen!D:D,MATCH(C:C,Notentabellen!A:A,1)),IF(AND(Notentabellen!$J$3=2,Notentabellen!$L$3=2),INDEX(Notentabellen!E:E,MATCH(C:C,Notentabellen!A:A,1)),IF(AND(Notentabellen!$J$3 =3,Notentabellen!$L$3=1), INDEX(Notentabellen!F:F,MATCH(C:C,Notentabellen!A:A,1)), IF(AND(Notentabellen!$J$3 =3,Notentabellen!$L$3=2), INDEX(Notentabellen!G:G,MATCH(C:C,Notentabellen!A:A,1)))))))))","v":""}]
["",{"$f":"IF(C8=\"\",\"\",INDEX(Laufliste!B:B,_xlfn.AGGREGATE(15,6,ROW(Laufliste!G:G)/(Laufliste!G:G=C8),COUNTIF($C$4:C8,C8)),1))","v":""},{"$f":"IF(ISERROR(_xlfn.AGGREGATE(15,6,Laufliste!G:G,ROW()-3)),\"\",IF(ROWS($A$4:A8)<=Hilfsregister!$C$2,_xlfn.AGGREGATE(15,6,Laufliste!G:G,ROW()-3),\"\"))","v":""},{"$f":"IF(C8 = \"\", \"\", IF(AND(Notentabellen!$J$3=1,Notentabellen!$L$3=1),INDEX(Notentabellen!B:B,MATCH(C:C,Notentabellen!A:A,1)),IF(AND(Notentabellen!$J$3=1,Notentabellen!$L$3=2),INDEX(Notentabellen!C:C,MATCH(C:C,Notentabellen!A:A,1)),IF(AND(Notentabellen!$J$3=2,Notentabellen!$L$3=1),INDEX(Notentabellen!D:D,MATCH(C:C,Notentabellen!A:A,1)),IF(AND(Notentabellen!$J$3=2,Notentabellen!$L$3=2),INDEX(Notentabellen!E:E,MATCH(C:C,Notentabellen!A:A,1)),IF(AND(Notentabellen!$J$3 =3,Notentabellen!$L$3=1), INDEX(Notentabellen!F:F,MATCH(C:C,Notentabellen!A:A,1)), IF(AND(Notentabellen!$J$3 =3,Notentabellen!$L$3=2), INDEX(Notentabellen!G:G,MATCH(C:C,Notentabellen!A:A,1)))))))))","v":""}]
["",{"$f":"IF(C9=\"\",\"\",INDEX(Laufliste!B:B,_xlfn.AGGREGATE(15,6,ROW(Laufliste!G:G)/(Laufliste!G:G=C9),COUNTIF($C$4:C9,C9)),1))","v":""},{"$f":"IF(ISERROR(_xlfn.AGGREGATE(15,6,Laufliste!G:G,ROW()-3)),\"\",IF(ROWS($A$4:A9)<=Hilfsregister!$C$2,_xlfn.AGGREGATE(15,6,Laufliste!G:G,ROW()-3),\"\"))","v":""},{"$f":"IF(C9 = \"\", \"\", IF(AND(Notentabellen!$J$3=1,Notentabellen!$L$3=1),INDEX(Notentabellen!B:B,MATCH(C:C,Notentabellen!A:A,1)),IF(AND(Notentabellen!$J$3=1,Notentabellen!$L$3=2),INDEX(Notentabellen!C:C,MATCH(C:C,Notentabellen!A:A,1)),IF(AND(Notentabellen!$J$3=2,Notentabellen!$L$3=1),INDEX(Notentabellen!D:D,MATCH(C:C,Notentabellen!A:A,1)),IF(AND(Notentabellen!$J$3=2,Notentabellen!$L$3=2),INDEX(Notentabellen!E:E,MATCH(C:C,Notentabellen!A:A,1)),IF(AND(Notentabellen!$J$3 =3,Notentabellen!$L$3=1), INDEX(Notentabellen!F:F,MATCH(C:C,Notentabellen!A:A,1)), IF(AND(Notentabellen!$J$3 =3,Notentabellen!$L$3=2), INDEX(Notentabellen!G:G,MATCH(C:C,Notentabellen!A:A,1)))))))))","v":""}]
["",{"$f":"IF(C10=\"\",\"\",INDEX(Laufliste!B:B,_xlfn.AGGREGATE(15,6,ROW(Laufliste!G:G)/(Laufliste!G:G=C10),COUNTIF($C$4:C10,C10)),1))","v":""},{"$f":"IF(ISERROR(_xlfn.AGGREGATE(15,6,Laufliste!G:G,ROW()-3)),\"\",IF(ROWS($A$4:A10)<=Hilfsregister!$C$2,_xlfn.AGGREGATE(15,6,Laufliste!G:G,ROW()-3),\"\"))","v":""},{"$f":"IF(C10 = \"\", \"\", IF(AND(Notentabellen!$J$3=1,Notentabellen!$L$3=1),INDEX(Notentabellen!B:B,MATCH(C:C,Notentabellen!A:A,1)),IF(AND(Notentabellen!$J$3=1,Notentabellen!$L$3=2),INDEX(Notentabellen!C:C,MATCH(C:C,Notentabellen!A:A,1)),IF(AND(Notentabellen!$J$3=2,Notentabellen!$L$3=1),INDEX(Notentabellen!D:D,MATCH(C:C,Notentabellen!A:A,1)),IF(AND(Notentabellen!$J$3=2,Notentabellen!$L$3=2),INDEX(Notentabellen!E:E,MATCH(C:C,Notentabellen!A:A,1)),IF(AND(Notentabellen!$J$3 =3,Notentabellen!$L$3=1), INDEX(Notentabellen!F:F,MATCH(C:C,Notentabellen!A:A,1)), IF(AND(Notentabellen!$J$3 =3,Notentabellen!$L$3=2), INDEX(Notentabellen!G:G,MATCH(C:C,Notentabellen!A:A,1)))))))))","v":""}]
{"$rows_left_out":94}
{"sheet":"Notentabellen","index":4,"n_rows":39,"n_cols":12,"rows_kept":39,"cut":false,"hidden":false,"merged":[[0,0,0,6]]}
["Notentabellen\nerstellt von Roman Marxer (romanmarxer@hotmail.com)  "]
["Zeit","Noten Knaben 1. Sek","Noten Mädchen 1. Sek","Noten Jungs 2. Sek","Noten Mädchen 2. Sek","Noten Jungs 3. Sek","Noten Mädchen 3. Sek",null,"Hilfsfelder"]
["00:00:00",6,6,6,6,6,6,null,"Sekundarstufe 1",1,"Jungs",1]
["00:00:05",6,6,6,6,6,6,null,"Sekundarstufe 2",null,"Mädchen"]
["00:00:10",6,6,6,6,6,6,null,"Sekundarstufe 3"]
["00:00:15",6,6,6,6,6,6]
["00:00:20",6,6,6,6,6,6]
["00:00:25",5.75,6,5.75,6,5.75,6]
["00:00:30",5.5,6,5.5,6,5.5,6]
["00:00:35",5.25,5.75,5.25,5.75,5.25,5.75]
{"$rows_left_out":30}
{"sheet":"Hilfsregister","index":5,"n_rows":12,"n_cols":3,"rows_kept":12,"cut":false,"hidden":true,"merged":[]}
[null,"Ausgabe:","Umrechung Ausgabe in Top"]
["Top 5",6,{"$f":"IF(B2<=10,B2*5,100)","v":30}]
["Top 10"]
["Top 15"]
["Top 20"]
["Top 25"]
["Top 30"]
["Top 35"]
["Top 40"]
["Top 45"]
{"$rows_left_out":2}